program: Orca
programVersion: 5.0.2
elementType: F F F O O O O N C C C C C C C C C C C C C C C C C C C C C C C C H H H H H H H H H H H H H H H H H H H H H H H H
charge: 0
multiplicity: 1
keywords: wb97x-d3
keywords: def2-TZVPP
keywords: def2/J RIJCOSX
keywords: DEFGRID2
keywords: scfconv7
keywords: smallprint printgap noloewdin
keywords: NOSOSCF
formula: C24H24F3NO4
InChI: InChI=1/C24H24F3NO4/c1-22(2,3)16-9-11-17(12-10-16)23(15-28,21(30)32-14-13-31-4)20(29)18-7-5-6-8-19(18)24(25,26)27/h5-12H,13-14H2,1-4H3
56 atoms
F  -3.133189 3.145806 -0.1411
F  -4.661163 2.110077 0.947797
F  -3.428195 1.030259 -0.437612
O  -1.569904 -0.768664 -2.101913
O  -0.668633 1.847084 -0.893062
O  0.573832 -0.648575 -2.749633
O  -1.972149 -3.433163 -2.790617
N  -1.267451 -2.275332 0.899066
C  5.710347 -0.091138 0.82466
C  4.221716 -0.211193 0.521382
C  5.982523 1.251385 1.516018
C  6.209367 -1.210224 1.73849
C  6.496258 -0.157672 -0.491339
C  -0.021098 -0.391239 -0.406031
C  1.467039 -0.355123 -0.086813
C  3.603137 0.729982 -0.30355
C  3.421983 -1.230891 1.021965
C  2.258007 0.665612 -0.60885
C  2.066795 -1.304813 0.725191
C  -0.649407 0.989985 -0.057985
C  -0.274365 -0.621731 -1.913596
C  -1.156908 1.198338 1.331614
C  -0.716566 -1.446797 0.324493
C  -2.435516 1.706292 1.588914
C  -0.306686 0.919958 2.395813
C  -2.828618 1.925928 2.90081
C  -3.412762 2.001694 0.479925
C  -2.055409 -1.062482 -3.409598
C  -0.704038 1.156536 3.701158
C  -1.966859 1.659001 3.953242
C  -1.770646 -2.506309 -3.811074
C  -3.293614 -3.542102 -2.334915
H  5.437649 1.328066 2.457884
H  7.0468 1.357416 1.735146
H  5.691761 2.100023 0.896149
H  6.073406 -2.196418 1.291647
H  5.708745 -1.203575 2.708232
H  7.276789 -1.085111 1.925055
H  6.225554 0.648838 -1.17311
H  6.316742 -1.10041 -1.00975
H  7.568207 -0.077623 -0.30017
H  4.182258 1.540806 -0.72712
H  3.841876 -1.997159 1.658476
H  1.833622 1.419042 -1.257541
H  1.48638 -2.118503 1.141027
H  0.684491 0.531654 2.206581
H  -3.818217 2.301455 3.116707
H  -1.627486 -0.38181 -4.149434
H  -3.123959 -0.860902 -3.346878
H  -0.025358 0.941933 4.515137
H  -2.29168 1.839052 4.968888
H  -2.393206 -2.720763 -4.695283
H  -0.729316 -2.610092 -4.117169
H  -3.629447 -2.661844 -1.776541
H  -4.000369 -3.720821 -3.156351
H  -3.334061 -4.394469 -1.658861
totalener: -1584.33168531 hartree
nucrepener: 3402.73916398 hartree
electener: -4987.07084929 hartree
oneelecener: -8935.42904898 hartree
twoeener: 3948.35819969 hartree
kineticenergy: 1577.96790052 hartree
xcener: -146.966849348707 hartree
chargesum: -0.0000000
charge: -0.152650 -0.173816 -0.165620 -0.239306 -0.258848 -0.312587 -0.317333 0.012982 0.245463 -0.078459 -0.292291 -0.334358 -0.290383 0.808805 -0.218942 -0.156992 -0.081429 -0.129877 -0.192711 0.125130 0.285868 0.102181 -0.466315 -0.243368 -0.174964 -0.042654 0.532412 -0.061742 -0.098779 -0.125267 0.003198 -0.116147 0.097198 0.088871 0.089981 0.097594 0.094450 0.092132 0.089389 0.103124 0.087826 0.112748 0.123131 0.135375 0.127882 0.161421 0.132827 0.114117 0.119561 0.131866 0.134261 0.077308 0.109785 0.088301 0.083995 0.115655
qa: -0.1526 -0.1738 -0.1656 -0.2393 -0.2588 -0.3126 -0.3173 0.0130 0.2455 -0.0785 -0.2923 -0.3344 -0.2904 0.8088 -0.2189 -0.1570 -0.0814 -0.1299 -0.1927 0.1251 0.2859 0.1022 -0.4663 -0.2434 -0.1750 -0.0427 0.5324 -0.0617 -0.0988 -0.1253 0.0032 -0.1161 0.0972 0.0889 0.0900 0.0976 0.0944 0.0921 0.0894 0.1031 0.0878 0.1127 0.1231 0.1354 0.1279 0.1614 0.1328 0.1141 0.1196 0.1319 0.1343 0.0773 0.1098 0.0883 0.0840 0.1157
va: 1.1507 1.1277 1.1363 2.1464 2.1856 2.1956 1.9688 3.1105 3.7847 3.8097 3.9233 3.9309 3.9235 3.1495 3.8673 4.0918 3.9275 4.0941 4.0282 3.8765 4.2830 3.4745 4.1358 4.0279 3.9744 3.8940 4.4567 3.8507 3.9939 3.9660 3.9021 3.9231 1.0068 1.0065 1.0075 1.0026 1.0028 1.0117 1.0080 1.0059 1.0055 1.0111 1.0056 1.0232 1.0299 0.9920 1.0143 1.0147 0.9894 1.0018 1.0001 0.9997 1.0062 0.9847 0.9914 0.9979
dispcorr: -0.032263356 hartree
energy: -1584.363948669308
dipole: 52.26048 -51.64808 0.61240 -19.39295 19.73135 0.33840 0.72895 0.12689 0.85583
magnitude: 1.10544 au
magnitude: 2.80981 debye
