program: Orca
programVersion: 5.0.2
elementType: F F F O O O O N C C C C C C C C C C C C C C C C C C C C C C C C H H H H H H H H H H H H H H H H H H H H H H H H
charge: 0
multiplicity: 1
keywords: wb97x-d3
keywords: def2-TZVPP
keywords: def2/J RIJCOSX
keywords: DEFGRID2
keywords: scfconv7
keywords: smallprint printgap noloewdin
keywords: NOSOSCF
formula: C24H24F3NO4
InChI: InChI=1/C24H24F3NO4/c1-22(2,3)16-9-11-17(12-10-16)23(15-28,21(30)32-14-13-31-4)20(29)18-7-5-6-8-19(18)24(25,26)27/h5-12H,13-14H2,1-4H3
56 atoms
F  -3.589353 3.160794 -0.460399
F  -1.680399 2.201213 -0.580721
F  -2.186035 3.412553 1.136486
O  -1.180856 -0.953348 -0.920882
O  -0.373373 1.369938 1.857167
O  -0.896045 -2.936358 0.096374
O  0.315045 -0.711871 -3.321848
N  0.032191 -2.268494 3.364531
C  5.208642 0.162417 -1.077101
C  3.819989 -0.077584 -0.498008
C  5.706535 -1.124257 -1.748517
C  5.215418 1.27857 -2.121184
C  6.166637 0.557692 0.054521
C  -0.121557 -0.900753 1.148801
C  1.273572 -0.568253 0.618666
C  2.704377 0.662392 -0.874989
C  3.622999 -1.074245 0.455895
C  1.450244 0.421677 -0.337896
C  2.37717 -1.3190 1.005702
C  -0.943114 0.380346 1.510978
C  -0.796719 -1.746136 0.063094
C  -2.437679 0.283267 1.467927
C  -0.029626 -1.686997 2.375307
C  -3.240606 1.3065 0.941836
C  -3.050911 -0.829539 2.034141
C  -4.621003 1.190126 1.006395
C  -2.661866 2.526193 0.267089
C  -1.570656 -1.548976 -2.160291
C  -4.431613 -0.927684 2.10675
C  -5.217766 0.08501 1.594569
C  -0.363184 -1.889396 -3.002578
C  1.571938 -0.935433 -3.894072
H  5.040491 -1.429733 -2.557434
H  6.700909 -0.973589 -2.17316
H  5.774599 -1.955949 -1.046749
H  4.565791 1.052413 -2.968952
H  6.224297 1.410751 -2.513967
H  4.903772 2.235801 -1.700319
H  7.169984 0.734816 -0.337971
H  6.245099 -0.218885 0.816091
H  5.833357 1.470959 0.548814
H  2.790857 1.451308 -1.608541
H  4.45498 -1.681471 0.789681
H  0.623391 1.023158 -0.681635
H  2.278925 -2.104541 1.743402
H  -2.459798 -1.627295 2.461286
H  -5.251007 1.96329 0.591965
H  -2.187685 -0.800396 -2.654895
H  -2.172088 -2.442811 -1.988655
H  -4.881713 -1.796536 2.567026
H  -6.296165 0.020057 1.642424
H  0.282534 -2.598156 -2.464268
H  -0.717066 -2.413116 -3.90482
H  2.241006 -1.481897 -3.217658
H  1.508592 -1.492595 -4.83783
H  2.019005 0.035889 -4.101967
totalener: -1584.33117022 hartree
nucrepener: 3475.23109535 hartree
electener: -5059.56226558 hartree
oneelecener: -9079.92952887 hartree
twoeener: 4020.36726329 hartree
kineticenergy: 1577.96621304 hartree
xcener: -146.966112887350 hartree
chargesum: -0.0000000
charge: -0.175395 -0.165012 -0.148106 -0.244139 -0.225755 -0.300415 -0.312569 0.016386 0.255691 -0.054268 -0.290074 -0.328146 -0.288004 0.680426 -0.087874 -0.192764 -0.122441 -0.127507 -0.200744 0.063130 0.173078 0.121284 -0.314497 -0.267852 -0.130992 -0.043529 0.542628 -0.021286 -0.120399 -0.122705 0.006131 -0.122177 0.088018 0.090350 0.090826 0.084756 0.092766 0.099792 0.087265 0.089084 0.103964 0.121251 0.109682 0.116881 0.127283 0.156518 0.134717 0.107578 0.103648 0.137885 0.136716 0.092582 0.086230 0.084592 0.097475 0.108037
qa: -0.1754 -0.1650 -0.1481 -0.2441 -0.2258 -0.3004 -0.3126 0.0164 0.2557 -0.0543 -0.2901 -0.3281 -0.2880 0.6804 -0.0879 -0.1928 -0.1224 -0.1275 -0.2007 0.0631 0.1731 0.1213 -0.3145 -0.2679 -0.1310 -0.0435 0.5426 -0.0213 -0.1204 -0.1227 0.0061 -0.1222 0.0880 0.0904 0.0908 0.0848 0.0928 0.0998 0.0873 0.0891 0.1040 0.1213 0.1097 0.1169 0.1273 0.1565 0.1347 0.1076 0.1036 0.1379 0.1367 0.0926 0.0862 0.0846 0.0975 0.1080
va: 1.1248 1.1298 1.1555 2.1707 2.2321 2.1949 1.9658 3.1070 3.7611 3.7101 3.9256 3.9324 3.9205 3.2081 3.7762 3.9504 4.0630 4.0367 4.1290 3.9783 4.4171 3.3914 4.0411 4.0564 3.9181 3.8895 4.4268 3.9185 4.0139 3.9563 3.9199 3.9378 1.0091 1.0074 1.0083 1.0063 1.0123 1.0027 1.0058 1.0073 1.0055 1.0031 1.0129 1.0376 1.0185 1.0127 1.0140 1.0049 1.0147 0.9998 0.9992 0.9946 1.0022 0.9932 0.9933 0.9934
dispcorr: -0.034840029 hartree
energy: -1584.366010253432
dipole: 49.45290 -49.99268 -0.53978 -19.18592 18.77238 -0.41354 -25.80752 23.96678 -1.84074
magnitude: 1.96232 au
magnitude: 4.98782 debye
