program: Orca
programVersion: 5.0.2
elementType: F F F O O O O N C C C C C C C C C C C C C C C C C C C C C C C C H H H H H H H H H H H H H H H H H H H H H H H H
charge: 0
multiplicity: 1
keywords: wb97x-d3
keywords: def2-TZVPP
keywords: def2/J RIJCOSX
keywords: DEFGRID2
keywords: scfconv7
keywords: smallprint printgap noloewdin
keywords: NOSOSCF
formula: C24H24F3NO4
InChI: InChI=1/C24H24F3NO4/c1-22(2,3)16-9-11-17(12-10-16)23(15-28,21(30)32-14-13-31-4)20(29)18-7-5-6-8-19(18)24(25,26)27/h5-12H,13-14H2,1-4H3
56 atoms
F  -0.906083 3.426051 2.504271
F  0.64882 2.581553 1.291115
F  -0.496736 1.318998 2.611971
O  -0.504796 -3.365524 0.21485
O  -2.887433 -0.625536 2.14755
O  -2.331617 -2.26085 -0.489624
O  0.068946 -3.036276 -2.565668
N  -0.154517 -2.234274 3.396956
C  3.659834 1.333742 -1.68124
C  2.52368 0.645074 -0.93707
C  4.018374 0.516428 -2.929442
C  3.203338 2.738144 -2.097935
C  4.915676 1.472814 -0.821362
C  -0.837044 -1.219943 1.093409
C  0.354539 -0.578916 0.392423
C  1.291602 0.462172 -1.56579
C  2.641935 0.178145 0.365215
C  0.228723 -0.141333 -0.92425
C  1.577888 -0.42365 1.021893
C  -2.066391 -0.290533 1.349036
C  -1.340148 -2.348934 0.173088
C  -2.251434 0.929306 0.49491
C  -0.459835 -1.795179 2.380864
C  -1.570345 2.130043 0.671543
C  -3.2077 0.832314 -0.513392
C  -1.823676 3.200986 -0.178292
C  -0.576249 2.356938 1.772503
C  -0.612999 -4.404407 -0.760112
C  -3.451408 1.900518 -1.357701
C  -2.750879 3.085717 -1.197044
C  0.4129 -4.179935 -1.844886
C  1.058893 -2.626535 -3.465329
H  4.829362 0.995552 -3.481404
H  4.346448 -0.488795 -2.65958
H  3.17293 0.41784 -3.611524
H  4.008983 3.265718 -2.612204
H  2.913661 3.32968 -1.228577
H  2.349311 2.708017 -2.775086
H  4.733633 2.068754 0.074376
H  5.699447 1.974272 -1.390624
H  5.311381 0.504434 -0.510933
H  1.145693 0.798865 -2.584649
H  3.572376 0.284099 0.904661
H  -0.699351 -0.26729 -1.465571
H  1.718939 -0.762729 2.03944
H  -3.747291 -0.09442 -0.645148
H  -1.298515 4.137257 -0.042383
H  -1.622073 -4.454712 -1.170977
H  -0.401374 -5.335972 -0.235528
H  -4.191999 1.805648 -2.140439
H  -2.935138 3.923996 -1.854955
H  1.409581 -4.085161 -1.389166
H  0.438371 -5.074685 -2.486852
H  1.99411 -2.359873 -2.958182
H  1.281906 -3.396456 -4.21514
H  0.689861 -1.743054 -3.983924
totalener: -1584.32984192 hartree
nucrepener: 3578.12307275 hartree
electener: -5162.45291467 hartree
oneelecener: -9285.86310423 hartree
twoeener: 4123.41018956 hartree
kineticenergy: 1577.99136136 hartree
xcener: -146.973076239937 hartree
chargesum: -0.0000000
charge: -0.166214 -0.163224 -0.165090 -0.252637 -0.240091 -0.338028 -0.308947 0.021054 0.279339 -0.046114 -0.309894 -0.295485 -0.337167 0.700855 -0.203913 -0.193495 -0.093441 -0.281047 -0.117019 0.180161 0.309498 0.126938 -0.397701 -0.116355 -0.179375 -0.137244 0.551779 -0.010222 -0.123149 -0.113711 0.024557 -0.130251 0.095244 0.097307 0.084676 0.088986 0.101826 0.085990 0.101839 0.092001 0.094660 0.110360 0.121424 0.133709 0.122491 0.139933 0.118083 0.108512 0.109586 0.135536 0.133555 0.076980 0.078653 0.093264 0.099319 0.101700
qa: -0.1662 -0.1632 -0.1651 -0.2526 -0.2401 -0.3380 -0.3089 0.0211 0.2793 -0.0461 -0.3099 -0.2955 -0.3372 0.7009 -0.2039 -0.1935 -0.0934 -0.2810 -0.1170 0.1802 0.3095 0.1269 -0.3977 -0.1164 -0.1794 -0.1372 0.5518 -0.0102 -0.1231 -0.1137 0.0246 -0.1303 0.0952 0.0973 0.0847 0.0890 0.1018 0.0860 0.1018 0.0920 0.0947 0.1104 0.1214 0.1337 0.1225 0.1399 0.1181 0.1085 0.1096 0.1355 0.1336 0.0770 0.0787 0.0933 0.0993 0.1017
va: 1.1450 1.1307 1.1386 2.1871 2.2245 2.1409 1.9778 3.1179 3.7318 3.7495 3.9227 3.9251 3.9361 3.3848 3.5590 4.0239 3.9596 4.0655 4.0219 4.0186 4.2679 3.5221 4.1385 3.7947 3.9904 4.0411 4.4224 3.9039 3.9628 3.9398 3.9255 3.9383 1.0107 1.0051 1.0054 1.0067 1.0089 1.0063 1.0015 1.0114 1.0021 1.0108 1.0050 1.0180 1.0299 1.0246 1.0173 1.0215 0.9986 0.9985 0.9987 0.9948 1.0000 0.9869 0.9928 0.9942
dispcorr: -0.037325416 hartree
energy: -1584.367167338081
dipole: 33.74711 -32.63720 1.10991 -8.79428 9.12159 0.32731 -43.43964 40.36382 -3.07582
magnitude: 3.28629 au
magnitude: 8.35308 debye
