program: Orca
programVersion: 5.0.2
elementType: F F F O O O O N C C C C C C C C C C C C C C C C C C C C C C C C H H H H H H H H H H H H H H H H H H H H H H H H
charge: 0
multiplicity: 1
keywords: wb97x-d3
keywords: def2-TZVPP
keywords: def2/J RIJCOSX
keywords: DEFGRID2
keywords: scfconv7
keywords: smallprint printgap noloewdin
keywords: NOSOSCF
formula: C24H24F3NO4
InChI: InChI=1/C24H24F3NO4/c1-22(2,3)16-9-11-17(12-10-16)23(15-28,21(30)32-14-13-31-4)20(29)18-7-5-6-8-19(18)24(25,26)27/h5-12H,13-14H2,1-4H3
56 atoms
F  0.437713 2.737488 1.694456
F  -0.622892 1.191837 2.760333
F  -1.260062 3.238349 2.908958
O  -0.4782 -3.274468 -0.019164
O  -2.949467 -0.720856 2.095744
O  -2.341643 -2.180186 -0.635571
O  0.127594 -2.780135 -2.781145
N  -0.23652 -2.416382 3.25669
C  3.758383 1.244713 -1.592869
C  2.564106 0.642952 -0.863017
C  5.024416 1.2357 -0.736235
C  4.035726 0.43074 -2.864375
C  3.441483 2.696765 -1.971359
C  -0.878979 -1.219594 1.030026
C  0.323605 -0.525392 0.399804
C  2.632458 0.164473 0.439039
C  1.332511 0.539044 -1.510497
C  1.53364 -0.409559 1.063066
C  0.235851 -0.038603 -0.902488
C  -2.12312 -0.325917 1.331027
C  -1.347437 -2.287336 0.020198
C  -2.303921 0.949629 0.561422
C  -0.521871 -1.89271 2.275367
C  -1.680373 2.152174 0.878645
C  -3.19282 0.907336 -0.510167
C  -1.919467 3.281941 0.104201
C  -0.77648 2.322555 2.063499
C  -0.56295 -4.251053 -1.058501
C  -3.424029 2.034617 -1.277653
C  -2.777861 3.223658 -0.977261
C  0.475483 -3.954391 -2.113347
C  1.122135 -2.326874 -3.65452
H  4.906356 1.823081 0.175637
H  5.320966 0.224288 -0.45306
H  5.852999 1.671389 -1.29621
H  3.192647 0.446038 -3.556052
H  4.249757 -0.612145 -2.624399
H  4.899612 0.835084 -3.395417
H  4.282138 3.14539 -2.504331
H  3.247472 3.298816 -1.082787
H  2.566109 2.771048 -2.61737
H  3.55602 0.22194 0.997317
H  1.218506 0.904924 -2.523359
H  1.643996 -0.779599 2.073644
H  -0.685199 -0.11799 -1.464123
H  -3.689982 -0.021236 -0.750696
H  -1.436558 4.218868 0.34915
H  -1.56546 -4.284003 -1.486466
H  -0.350074 -5.212179 -0.590694
H  -4.1124 1.982543 -2.110413
H  -2.951671 4.108021 -1.574804
H  1.464267 -3.869999 -1.638898
H  0.522778 -4.814394 -2.800086
H  2.054206 -2.084938 -3.129568
H  1.350911 -3.05985 -4.438987
H  0.756435 -1.419624 -4.133259
totalener: -1584.33003463 hartree
nucrepener: 3559.91814959 hartree
electener: -5144.24818422 hartree
oneelecener: -9249.38136765 hartree
twoeener: 4105.13318344 hartree
kineticenergy: 1577.98303132 hartree
xcener: -146.970883491933 hartree
chargesum: 0.0000000
charge: -0.167569 -0.165465 -0.165535 -0.252281 -0.238205 -0.339661 -0.308092 0.021040 0.283220 -0.045635 -0.336810 -0.324356 -0.292804 0.693960 -0.203589 -0.086100 -0.206726 -0.123359 -0.261656 0.175482 0.313811 0.151916 -0.398110 -0.141880 -0.191471 -0.129770 0.558651 -0.010549 -0.117729 -0.120431 0.026781 -0.132233 0.098112 0.097283 0.092586 0.084769 0.098463 0.097674 0.089564 0.102187 0.087523 0.122361 0.112416 0.122516 0.130373 0.144146 0.118394 0.108434 0.109497 0.136102 0.133479 0.076724 0.078337 0.091578 0.100204 0.102435
qa: -0.1676 -0.1655 -0.1655 -0.2523 -0.2382 -0.3397 -0.3081 0.0210 0.2832 -0.0456 -0.3368 -0.3244 -0.2928 0.6940 -0.2036 -0.0861 -0.2067 -0.1234 -0.2617 0.1755 0.3138 0.1519 -0.3981 -0.1419 -0.1915 -0.1298 0.5587 -0.0105 -0.1177 -0.1204 0.0268 -0.1322 0.0981 0.0973 0.0926 0.0848 0.0985 0.0977 0.0896 0.1022 0.0875 0.1224 0.1124 0.1225 0.1304 0.1441 0.1184 0.1084 0.1095 0.1361 0.1335 0.0767 0.0783 0.0916 0.1002 0.1024
va: 1.1323 1.1388 1.1451 2.1884 2.2236 2.1382 1.9780 3.1180 3.7248 3.7572 3.9352 3.9299 3.9247 3.3775 3.5833 3.9593 4.0447 4.0193 4.0644 4.0199 4.2576 3.5106 4.1387 3.8240 3.9826 4.0403 4.4190 3.9044 3.9610 3.9472 3.9232 3.9422 1.0022 1.0019 1.0114 1.0043 1.0024 1.0130 1.0058 1.0076 1.0058 1.0043 1.0088 1.0296 1.0204 1.0242 1.0168 1.0223 0.9984 0.9983 0.9989 0.9948 0.9999 0.9853 0.9939 0.9942
dispcorr: -0.036887173 hartree
energy: -1584.366921797656
dipole: 36.39947 -35.16053 1.23893 -7.97475 8.47401 0.49925 -45.09811 42.01746 -3.08065
magnitude: 3.35777 au
magnitude: 8.53477 debye
