program: Orca
programVersion: 5.0.2
elementType: F F F O O O O N C C C C C C C C C C C C C C C C C C C C C C C C H H H H H H H H H H H H H H H H H H H H H H H H
charge: 0
multiplicity: 1
keywords: wb97x-d3
keywords: def2-TZVPP
keywords: def2/J RIJCOSX
keywords: DEFGRID2
keywords: scfconv7
keywords: smallprint printgap noloewdin
keywords: NOSOSCF
formula: C24H24F3NO4
InChI: InChI=1/C24H24F3NO4/c1-22(2,3)16-9-11-17(12-10-16)23(15-28,21(30)32-14-13-31-4)20(29)18-7-5-6-8-19(18)24(25,26)27/h5-12H,13-14H2,1-4H3
56 atoms
F  -4.457685 1.907571 0.842444
F  -4.87782 0.418194 2.333183
F  -3.748627 -0.108585 0.582194
O  -0.340902 -0.449348 -2.574947
O  -1.667177 1.572319 -0.770203
O  -2.06228 -1.662833 -1.813218
O  1.3629 -2.099518 -4.506649
N  -1.498972 -2.300866 1.48278
C  5.19672 0.024159 0.077068
C  3.683748 -0.143216 0.021904
C  5.751006 0.052622 -1.353545
C  5.535522 1.34055 0.789123
C  5.876901 -1.116407 0.833981
C  -0.647531 -0.529791 -0.232441
C  0.870615 -0.388272 -0.125425
C  3.019355 -1.224305 0.585293
C  2.896976 0.817165 -0.618802
C  1.637085 -1.345829 0.518184
C  1.522655 0.703103 -0.698129
C  -1.31629 0.834127 0.101818
C  -1.112278 -0.960173 -1.639458
C  -1.437534 1.182346 1.555848
C  -1.139499 -1.526486 0.714996
C  -2.673848 1.217305 2.202228
C  -0.288448 1.524442 2.259201
C  -2.74319 1.60358 3.532347
C  -3.944892 0.856688 1.485269
C  -0.626989 -0.771278 -3.941146
C  -0.36826 1.91785 3.585375
C  -1.595501 1.957666 4.222134
C  -0.026644 -2.097708 -4.372842
C  2.097793 -2.223743 -3.315953
H  6.836391 0.167701 -1.339879
H  5.519477 -0.872318 -1.883774
H  5.342383 0.877893 -1.93728
H  6.617028 1.480328 0.837277
H  5.152703 1.344784 1.810603
H  5.11802 2.207163 0.275795
H  6.955459 -0.955298 0.851839
H  5.703583 -2.084992 0.362321
H  5.542908 -1.177951 1.871172
H  3.569365 -2.000934 1.097481
H  3.362767 1.681077 -1.076199
H  1.169351 -2.20402 0.982164
H  0.966906 1.473373 -1.215318
H  0.674673 1.496921 1.769213
H  -3.695117 1.622889 4.043658
H  -0.193871 0.044531 -4.518642
H  -1.705743 -0.78264 -4.107952
H  0.533052 2.190591 4.117045
H  -1.665021 2.257984 5.258489
H  -0.373403 -2.900978 -3.707693
H  -0.433368 -2.315149 -5.364711
H  1.675238 -2.984994 -2.648302
H  3.105156 -2.539301 -3.587764
H  2.175088 -1.288885 -2.752953
totalener: -1584.32949150 hartree
nucrepener: 3438.51497077 hartree
electener: -5022.84446227 hartree
oneelecener: -9006.17422959 hartree
twoeener: 3983.32976732 hartree
kineticenergy: 1577.97464733 hartree
xcener: -146.968337170321 hartree
chargesum: -0.0000000
charge: -0.158472 -0.168426 -0.155077 -0.244720 -0.242888 -0.309455 -0.321830 0.024041 0.278048 -0.105378 -0.295626 -0.292754 -0.338960 0.777737 -0.278223 -0.078217 -0.099936 -0.167269 -0.232882 0.131740 0.291119 0.073059 -0.392971 -0.194922 -0.166338 -0.057508 0.537599 -0.024809 -0.109487 -0.129098 0.001166 -0.092806 0.091823 0.096655 0.092783 0.091146 0.097996 0.089473 0.094002 0.096904 0.097522 0.125784 0.111656 0.126260 0.135269 0.137976 0.129303 0.107576 0.104589 0.131223 0.133828 0.092448 0.092178 0.077742 0.105516 0.083892
qa: -0.1585 -0.1684 -0.1551 -0.2447 -0.2429 -0.3095 -0.3218 0.0240 0.2780 -0.1054 -0.2956 -0.2928 -0.3390 0.7777 -0.2782 -0.0782 -0.0999 -0.1673 -0.2329 0.1317 0.2911 0.0731 -0.3930 -0.1949 -0.1663 -0.0575 0.5376 -0.0248 -0.1095 -0.1291 0.0012 -0.0928 0.0918 0.0967 0.0928 0.0911 0.0980 0.0895 0.0940 0.0969 0.0975 0.1258 0.1117 0.1263 0.1353 0.1380 0.1293 0.1076 0.1046 0.1312 0.1338 0.0924 0.0922 0.0777 0.1055 0.0839
va: 1.1442 1.1385 1.1477 2.1686 2.2056 2.1902 1.9850 3.1124 3.7454 3.8074 3.9248 3.9208 3.9369 3.1613 3.7806 3.9283 3.9960 4.0418 4.0058 4.0231 4.2693 3.5524 4.0628 3.9657 3.9890 3.9458 4.4461 3.8257 3.9993 3.9651 3.9476 3.9497 1.0070 1.0078 1.0064 1.0068 1.0065 1.0072 1.0117 1.0019 1.0021 1.0047 1.0136 1.0289 1.0281 1.0073 1.0147 1.0043 1.0182 1.0011 0.9998 1.0084 1.0030 0.9977 0.9949 0.9806
dispcorr: -0.034821429 hartree
energy: -1584.364312927917
dipole: 70.56056 -68.12932 2.43123 -6.28322 7.31211 1.02889 -13.84778 14.37080 0.52302
magnitude: 2.69129 au
magnitude: 6.84073 debye
