program: Orca
programVersion: 5.0.2
elementType: F F F O O O O N C C C C C C C C C C C C C C C C C C C C C C C C H H H H H H H H H H H H H H H H H H H H H H H H
charge: 0
multiplicity: 1
keywords: wb97x-d3
keywords: def2-TZVPP
keywords: def2/J RIJCOSX
keywords: DEFGRID2
keywords: scfconv7
keywords: smallprint printgap noloewdin
keywords: NOSOSCF
formula: C24H24F3NO4
InChI: InChI=1/C24H24F3NO4/c1-22(2,3)16-9-11-17(12-10-16)23(15-28,21(30)32-14-13-31-4)20(29)18-7-5-6-8-19(18)24(25,26)27/h5-12H,13-14H2,1-4H3
56 atoms
F  -3.547689 0.989832 -0.277291
F  -3.218806 3.109594 -0.059363
F  -4.727867 2.127357 1.10551
O  -1.771362 -0.994348 -1.841283
O  -0.808805 1.728682 -0.836368
O  0.333448 -0.840717 -2.619608
O  -1.332125 -3.621671 -3.000688
N  -1.254787 -2.311981 1.217657
C  5.666958 -0.155944 0.583452
C  4.163877 -0.23005 0.3437
C  5.925823 0.114033 2.071602
C  6.313515 -1.488823 0.183817
C  6.328851 0.957828 -0.228309
C  -0.133182 -0.482882 -0.265975
C  1.372035 -0.413264 -0.043619
C  3.401871 -1.208348 0.980828
C  3.48677 0.64867 -0.495354
C  2.033991 -1.304158 0.793703
C  2.11725 0.563684 -0.690317
C  -0.75902 0.911136 0.036366
C  -0.469697 -0.804795 -1.741213
C  -1.226123 1.18259 1.428582
C  -0.763239 -1.503661 0.565738
C  -2.489786 1.720353 1.698997
C  -0.350878 0.933982 2.479865
C  -2.843347 1.997111 3.011446
C  -3.494068 1.989649 0.606702
C  -2.331263 -1.39272 -3.092021
C  -0.70858 1.227282 3.784811
C  -1.957171 1.757963 4.050211
C  -2.519084 -2.899422 -3.113085
C  -0.565571 -3.676303 -4.17449
H  5.474824 1.056679 2.384777
H  5.520913 -0.673613 2.70787
H  6.998107 0.173751 2.268237
H  5.92527 -2.326391 0.76397
H  7.392371 -1.452163 0.347077
H  6.140879 -1.709773 -0.870222
H  7.401827 0.9688 -0.032183
H  5.942919 1.944231 0.034343
H  6.197918 0.815818 -1.302314
H  3.877339 -1.922941 1.641011
H  4.022648 1.424974 -1.022716
H  1.488961 -2.08561 1.307502
H  1.643676 1.269625 -1.357648
H  0.629685 0.524144 2.27947
H  -3.821274 2.395451 3.239229
H  -1.718959 -1.032137 -3.919965
H  -3.304026 -0.903478 -3.151829
H  -0.01113 1.034711 4.58839
H  -2.25207 1.981348 5.06638
H  -3.144794 -3.189752 -2.265889
H  -3.073337 -3.155714 -4.029755
H  0.287608 -4.322246 -3.974042
H  -1.133122 -4.105492 -5.010311
H  -0.179029 -2.70018 -4.482754
totalener: -1584.33351080 hartree
nucrepener: 3392.14180653 hartree
electener: -4976.47531733 hartree
oneelecener: -8914.34951452 hartree
twoeener: 3937.87419719 hartree
kineticenergy: 1577.96687759 hartree
xcener: -146.967230634784 hartree
chargesum: -0.0000000
charge: -0.165390 -0.152908 -0.174023 -0.243778 -0.260098 -0.323913 -0.322059 0.025645 0.246826 -0.074373 -0.293905 -0.291085 -0.336501 0.774734 -0.203913 -0.096192 -0.142693 -0.246488 -0.090192 0.119435 0.329530 0.117130 -0.466898 -0.244060 -0.188757 -0.039698 0.531960 -0.059458 -0.094166 -0.128141 0.033865 -0.107084 0.098547 0.088461 0.088950 0.087921 0.088028 0.102924 0.091624 0.094812 0.099359 0.111636 0.122732 0.133029 0.131979 0.164256 0.132928 0.106344 0.108676 0.132100 0.133658 0.095988 0.073749 0.110028 0.079735 0.089184
qa: -0.1654 -0.1529 -0.1740 -0.2438 -0.2601 -0.3239 -0.3221 0.0256 0.2468 -0.0744 -0.2939 -0.2911 -0.3365 0.7747 -0.2039 -0.0962 -0.1427 -0.2465 -0.0902 0.1194 0.3295 0.1171 -0.4669 -0.2441 -0.1888 -0.0397 0.5320 -0.0595 -0.0942 -0.1281 0.0339 -0.1071 0.0985 0.0885 0.0889 0.0879 0.0880 0.1029 0.0916 0.0948 0.0994 0.1116 0.1227 0.1330 0.1320 0.1643 0.1329 0.1063 0.1087 0.1321 0.1337 0.0960 0.0737 0.1100 0.0797 0.0892
va: 1.1372 1.1500 1.1271 2.1573 2.1862 2.1846 1.9782 3.1197 3.7785 3.8035 3.9225 3.9226 3.9325 3.1847 3.8591 4.0297 3.9922 4.0548 4.0708 3.8859 4.2467 3.4617 4.1536 4.0321 3.9841 3.8892 4.4580 3.8745 3.9904 3.9710 3.9272 3.9167 1.0064 1.0070 1.0068 1.0078 1.0059 1.0057 1.0114 1.0025 1.0021 1.0121 1.0050 1.0262 1.0273 0.9887 1.0144 1.0060 1.0099 1.0015 1.0003 1.0010 1.0059 0.9961 0.9938 0.9907
dispcorr: -0.031820327 hartree
energy: -1584.365331124573
dipole: 57.78147 -56.92646 0.85501 -20.46064 20.74369 0.28305 -5.30033 5.77772 0.47739
magnitude: 1.01934 au
magnitude: 2.59096 debye
