program: Orca
programVersion: 5.0.2
elementType: O O N N N C C C C C C C C C C C C C C C C C C C C C C C C H H H H H H H H H H H H H H H H H H H H H H H H H H H H H H H
charge: 0
multiplicity: 1
keywords: wb97x-d3
keywords: def2-TZVPP
keywords: def2/J RIJCOSX
keywords: DEFGRID2
keywords: scfconv7
keywords: smallprint printgap noloewdin
keywords: NOSOSCF
formula: C24H31N3O2
InChI: InChI=1/C24H31N3O2/c1-15-16(2)26-27(9)20(15)21(29-22(28)24(6,7)8)19(14-25)17-10-12-18(13-11-17)23(3,4)5/h10-13H,1-9H3
60 atoms
O  -0.672026 -0.858723 0.667336
O  -1.188534 -2.116769 -1.09546
N  -3.347549 0.455412 -1.209088
N  -4.654402 0.415199 -1.001619
N  -1.369982 3.430955 -1.211221
C  5.446854 1.096486 -0.152424
C  3.923725 1.118421 -0.158818
C  5.950966 0.214748 -1.301178
C  5.964119 2.527637 -0.343193
C  6.012074 0.546778 1.155758
C  -0.274775 -3.192411 0.884225
C  3.238362 1.52762 -1.306335
C  3.157771 0.763708 0.948577
C  1.102429 1.187356 -0.239238
C  -2.656828 0.250736 -0.059721
C  -1.204907 0.239272 0.052412
C  1.856852 1.565652 -1.349499
C  1.770357 0.800678 0.916477
C  -0.373107 1.229972 -0.313233
C  -0.765939 -2.049876 0.026076
C  -0.325799 -4.482142 0.071568
C  -1.189048 -3.313098 2.110347
C  1.166451 -2.917527 1.330274
C  -3.585846 0.062466 0.946463
C  -4.823427 0.187406 0.291317
C  -3.362961 -0.18787 2.39717
C  -2.848397 0.601146 -2.556663
C  -6.172823 0.096105 0.908293
C  -0.946245 2.432521 -0.816519
H  7.04235 0.184957 -1.301342
H  5.590399 -0.810654 -1.201559
H  5.635786 0.587025 -2.276626
H  7.05601 2.540266 -0.340463
H  5.63183 2.958827 -1.288763
H  5.622472 3.181922 0.460922
H  5.682393 -0.476078 1.347006
H  5.734455 1.15797 2.016204
H  7.101917 0.534666 1.105929
H  3.788002 1.825635 -2.190404
H  3.632962 0.455812 1.869552
H  1.362567 1.88251 -2.26017
H  1.217887 0.542442 1.809561
H  0.025628 -5.308783 0.68951
H  0.314644 -4.434742 -0.809785
H  -1.338475 -4.721473 -0.253836
H  -1.129055 -2.440845 2.76049
H  -2.231623 -3.457241 1.822141
H  -0.884125 -4.181823 2.695113
H  1.533893 -3.780707 1.886402
H  1.243283 -2.049359 1.984002
H  1.83024 -2.764821 0.477871
H  -2.350485 0.063814 2.708862
H  -3.53618 -1.234104 2.656432
H  -4.047506 0.408007 3.002313
H  -2.98051 1.620611 -2.913966
H  -1.793681 0.348495 -2.596986
H  -3.386278 -0.07712 -3.214529
H  -6.313473 0.866364 1.668706
H  -6.32002 -0.866814 1.399891
H  -6.956074 0.215821 0.16173
elementType: O N C H
totalener: -1248.03526114 hartree
nucrepener: 2843.73421802 hartree
electener: -4091.76947915 hartree
oneelecener: -7346.57246067 hartree
twoeener: 3254.80298151 hartree
cpcmener: -0.03646936 hartree
kineticenergy: 1242.39254415 hartree
xcener: -123.451969787579 hartree
chargesum: 0.0000000
charge: -0.290828 -0.427635 0.141119 -0.339306 -0.104193 0.330535 -0.087522 -0.332065 -0.328848 -0.359373 0.275589 -0.201870 -0.139297 -0.025812 0.103944 0.151198 -0.189661 -0.238789 0.233446 0.349199 -0.323543 -0.360356 -0.352565 -0.084165 0.039895 -0.254796 -0.175505 -0.283166 -0.224283 0.097731 0.103536 0.098159 0.098062 0.098598 0.102770 0.104720 0.099902 0.101331 0.147053 0.148062 0.150608 0.161140 0.104101 0.105731 0.104305 0.105683 0.114680 0.114771 0.113419 0.101293 0.113813 0.103991 0.110502 0.113632 0.124938 0.118265 0.126655 0.105969 0.106266 0.098968
qa: -0.2908 -0.4276 0.1411 -0.3393 -0.1042 0.3305 -0.0875 -0.3321 -0.3288 -0.3594 0.2756 -0.2019 -0.1393 -0.0258 0.1039 0.1512 -0.1897 -0.2388 0.2334 0.3492 -0.3235 -0.3604 -0.3526 -0.0842 0.0399 -0.2548 -0.1755 -0.2832 -0.2243 0.0977 0.1035 0.0982 0.0981 0.0986 0.1028 0.1047 0.0999 0.1013 0.1471 0.1481 0.1506 0.1611 0.1041 0.1057 0.1043 0.1057 0.1147 0.1148 0.1134 0.1013 0.1138 0.1040 0.1105 0.1136 0.1249 0.1183 0.1267 0.1060 0.1063 0.0990
va: 2.1286 2.0852 3.2986 2.9300 3.1305 3.6361 3.7770 3.9180 3.9181 3.9277 3.7084 4.0096 3.8649 3.5397 3.7412 3.7887 3.9979 3.9435 3.6325 4.1267 3.9316 3.9368 3.9400 3.6075 3.9792 3.9202 3.8788 3.9556 4.0536 1.0030 1.0029 1.0043 1.0030 1.0034 1.0035 1.0005 1.0006 1.0064 1.0016 1.0002 1.0039 1.0020 1.0032 1.0057 1.0064 1.0036 0.9994 1.0037 1.0034 1.0056 1.0007 1.0033 0.9877 0.9994 0.9925 0.9991 1.0046 0.9926 0.9903 1.0134
dispcorr: -0.034615976 hartree
energy: -1248.069877113378
dipole: 25.13382 -22.80493 2.32889 -16.10703 13.95662 -2.15041 11.22357 -9.20312 2.02045
magnitude: 3.75901 au
magnitude: 9.55465 debye
