program: Orca
programVersion: 5.0.2
elementType: O O N N N C C C C C C C C C C C C C C C C C C C C C C C C H H H H H H H H H H H H H H H H H H H H H H H H H H H H H H H
charge: 0
multiplicity: 1
keywords: wb97x-d3
keywords: def2-TZVPP
keywords: def2/J RIJCOSX
keywords: DEFGRID2
keywords: scfconv7
keywords: smallprint printgap noloewdin
keywords: NOSOSCF
formula: C24H31N3O2
InChI: InChI=1/C24H31N3O2/c1-15-16(2)26-27(9)20(15)21(29-22(28)24(6,7)8)19(14-25)17-10-12-18(13-11-17)23(3,4)5/h10-13H,1-9H3
60 atoms
O  -0.636253 -0.823376 0.667838
O  -1.18396 -2.275258 -0.928658
N  -3.31815 0.307159 -1.329316
N  -4.62623 0.274705 -1.137523
N  -1.416897 3.350527 -1.400454
C  5.435512 1.147558 -0.076824
C  3.915858 1.127772 -0.191863
C  6.070141 -0.149909 -0.575525
C  5.985913 2.309833 -0.912733
C  5.832415 1.343418 1.3917
C  -0.209397 -3.129537 1.119076
C  3.213943 0.06237 -0.750704
C  3.16814 2.220654 0.255839
C  1.09766 1.160906 -0.381119
C  -2.642096 0.187639 -0.159924
C  -1.191844 0.205152 -0.039846
C  1.829892 0.077423 -0.852537
C  1.788315 2.242337 0.163976
C  -0.377225 1.187885 -0.464839
C  -0.724898 -2.076387 0.161731
C  -1.41827 -3.60174 1.942506
C  0.872895 -2.586372 2.052415
C  0.350634 -4.294866 0.304337
C  -3.584907 0.066247 0.845268
C  -4.814215 0.13596 0.164817
C  -3.382471 -0.072607 2.314174
C  -2.802928 0.387344 -2.675304
C  -6.176368 0.076358 0.759413
C  -0.972757 2.37377 -0.980326
H  7.154236 -0.095435 -0.462197
H  5.728893 -1.01942 -0.01015
H  5.866021 -0.332573 -1.632236
H  7.075724 2.342432 -0.847917
H  5.719305 2.202514 -1.965896
H  5.609599 3.275514 -0.571331
H  5.440752 0.541294 2.020378
H  5.47006 2.289647 1.796084
H  6.919825 1.342093 1.492794
H  3.738398 -0.802936 -1.131961
H  3.666139 3.079903 0.687992
H  1.331929 -0.756338 -1.331318
H  1.24569 3.105999 0.530085
H  -1.846366 -2.79462 2.539284
H  -1.09967 -4.387964 2.628788
H  -2.205159 -4.010284 1.307071
H  1.244845 -3.401926 2.673991
H  1.723322 -2.180823 1.501113
H  0.501084 -1.812225 2.723463
H  0.705185 -5.072456 0.980703
H  1.195744 -3.983426 -0.311778
H  -0.397766 -4.742647 -0.347815
H  -3.595227 -1.087645 2.657564
H  -4.050627 0.593744 2.862846
H  -2.364895 0.170001 2.617803
H  -2.845072 1.408607 -3.052485
H  -1.774115 0.040221 -2.706265
H  -3.399739 -0.253247 -3.32074
H  -6.941556 0.157643 -0.011364
H  -6.335223 0.885235 1.475323
H  -6.337902 -0.860654 1.295527
elementType: O N C H
totalener: -1248.04806283 hartree
nucrepener: 2843.03304951 hartree
electener: -4091.08111233 hartree
oneelecener: -7345.08459867 hartree
twoeener: 3254.00348634 hartree
cpcmener: -0.03075243 hartree
kineticenergy: 1242.37125489 hartree
xcener: -123.446160554749 hartree
chargesum: 0.0000000
charge: -0.269198 -0.409156 0.146034 -0.333056 -0.092573 0.319780 -0.079946 -0.357977 -0.323984 -0.327348 0.239897 -0.136052 -0.179292 0.007213 0.107698 0.145834 -0.258350 -0.197610 0.206274 0.321343 -0.335239 -0.331341 -0.317988 -0.080453 0.042705 -0.251893 -0.173092 -0.280658 -0.241485 0.100450 0.103987 0.100118 0.097223 0.103214 0.097027 0.103408 0.096943 0.097208 0.144746 0.142446 0.154686 0.146956 0.109524 0.108509 0.114264 0.104598 0.104466 0.101680 0.101856 0.109005 0.099336 0.109185 0.112834 0.101969 0.121247 0.122100 0.123043 0.100025 0.104224 0.103633
qa: -0.2692 -0.4092 0.1460 -0.3331 -0.0926 0.3198 -0.0799 -0.3580 -0.3240 -0.3273 0.2399 -0.1361 -0.1793 0.0072 0.1077 0.1458 -0.2583 -0.1976 0.2063 0.3213 -0.3352 -0.3313 -0.3180 -0.0805 0.0427 -0.2519 -0.1731 -0.2807 -0.2415 0.1005 0.1040 0.1001 0.0972 0.1032 0.0970 0.1034 0.0969 0.0972 0.1447 0.1424 0.1547 0.1470 0.1095 0.1085 0.1143 0.1046 0.1045 0.1017 0.1019 0.1090 0.0993 0.1092 0.1128 0.1020 0.1212 0.1221 0.1230 0.1000 0.1042 0.1036
va: 2.1375 2.0984 3.2983 2.9327 3.1347 3.6550 3.7717 3.9271 3.9186 3.9192 3.7365 3.8746 3.9963 3.6132 3.7627 3.7965 3.9765 3.9957 3.5844 4.1384 3.9219 3.9434 3.9345 3.6026 3.9750 3.9123 3.8792 3.9499 4.0730 1.0072 1.0005 1.0009 1.0031 1.0035 1.0044 1.0031 1.0047 1.0034 1.0013 1.0029 1.0152 1.0056 1.0030 1.0025 1.0066 1.0027 1.0052 1.0087 1.0025 1.0026 1.0145 0.9881 0.9989 1.0057 0.9916 0.9956 1.0075 1.0137 0.9932 0.9908
dispcorr: -0.034587376 hartree
energy: -1248.082650202628
dipole: 25.20871 -22.93888 2.26983 -14.74341 12.86631 -1.87710 13.42369 -11.41983 2.00386
magnitude: 3.56245 au
magnitude: 9.05503 debye
