program: Orca
programVersion: 5.0.2
elementType: O O N N N C C C C C C C C C C C C C C C C C C C C C C C C H H H H H H H H H H H H H H H H H H H H H H H H H H H H H H H
charge: 0
multiplicity: 1
keywords: wb97x-d3
keywords: def2-TZVPP
keywords: def2/J RIJCOSX
keywords: DEFGRID2
keywords: scfconv7
keywords: smallprint printgap noloewdin
keywords: NOSOSCF
formula: C24H31N3O2
InChI: InChI=1/C24H31N3O2/c1-15-16(2)26-27(9)20(15)21(29-22(28)24(6,7)8)19(14-25)17-10-12-18(13-11-17)23(3,4)5/h10-13H,1-9H3
60 atoms
O  -0.609204 -0.966723 0.493316
O  -1.304365 -2.125679 -1.277794
N  -3.324429 0.508602 -1.189121
N  -4.627153 0.48522 -0.962916
N  -1.427561 3.529508 -0.671235
C  5.464872 1.168217 -0.060639
C  3.941859 1.145635 -0.113158
C  5.961897 2.447134 -0.746783
C  5.933043 1.159412 1.399936
C  6.086122 -0.034642 -0.768914
C  -0.315417 -3.32453 0.591552
C  3.208269 2.133125 0.550248
C  3.223455 0.190935 -0.829142
C  1.119995 1.189504 -0.199581
C  -2.620571 0.212411 -0.069494
C  -1.165405 0.180915 0.008216
C  1.826415 2.159938 0.509395
C  1.836719 0.211911 -0.879758
C  -0.355567 1.226454 -0.236888
C  -0.810177 -2.124987 -0.18606
C  1.195256 -3.182736 0.820736
C  -0.598435 -4.589685 -0.211745
C  -1.047424 -3.389089 1.937168
C  -3.53756 -0.022274 0.938335
C  -4.782616 0.172856 0.313185
C  -3.295901 -0.361666 2.367798
C  -2.840335 0.807812 -2.515207
C  -6.128417 0.073125 0.93862
C  -0.966321 2.489686 -0.484451
H  7.053306 2.489662 -0.730004
H  5.644439 2.48655 -1.790749
H  5.591773 3.347396 -0.253426
H  7.024046 1.171442 1.447339
H  5.576547 2.027485 1.956052
H  5.588857 0.265229 1.923232
H  7.173555 0.01498 -0.691635
H  5.841245 -0.062709 -1.832307
H  5.772307 -0.981669 -0.325174
H  3.718654 2.904702 1.113149
H  3.736705 -0.58731 -1.376805
H  1.295314 2.939542 1.042575
H  1.32149 -0.526368 -1.481234
H  1.447496 -2.313192 1.427448
H  1.740882 -3.112078 -0.121912
H  1.559451 -4.066708 1.346487
H  -1.664648 -4.729275 -0.394334
H  -0.086117 -4.5879 -1.174435
H  -0.244649 -5.457341 0.346574
H  -0.819584 -2.53703 2.577105
H  -0.738849 -4.290098 2.469492
H  -2.129605 -3.440008 1.804318
H  -2.265467 -0.175411 2.667898
H  -3.516507 -1.409737 2.580031
H  -3.934409 0.235379 3.021129
H  -1.838383 0.409952 -2.650162
H  -3.498305 0.338337 -3.242565
H  -2.823955 1.882412 -2.695219
H  -6.241471 0.788886 1.755307
H  -6.304136 -0.919312 1.357632
H  -6.912276 0.273354 0.209374
elementType: O N C H
totalener: -1248.04863252 hartree
nucrepener: 2840.52674646 hartree
electener: -4088.57537898 hartree
oneelecener: -7340.10750275 hartree
twoeener: 3251.53212377 hartree
cpcmener: -0.03077261 hartree
kineticenergy: 1242.37615463 hartree
xcener: -123.446951145895 hartree
chargesum: -0.0000000
charge: -0.280273 -0.398050 0.155946 -0.334276 -0.093728 0.313726 -0.075542 -0.323462 -0.327346 -0.356769 0.281383 -0.184770 -0.135846 0.005173 0.082055 0.142125 -0.193915 -0.253613 0.209976 0.326194 -0.350370 -0.323545 -0.359539 -0.070598 0.042973 -0.246774 -0.172918 -0.281819 -0.251266 0.096956 0.102946 0.097145 0.096903 0.097817 0.103448 0.100347 0.099116 0.105291 0.143282 0.143759 0.146100 0.158020 0.106473 0.107435 0.112486 0.105435 0.103962 0.102785 0.105053 0.113124 0.111782 0.101022 0.107554 0.113231 0.121957 0.123402 0.120212 0.103914 0.103770 0.100141
qa: -0.2803 -0.3980 0.1559 -0.3343 -0.0937 0.3137 -0.0755 -0.3235 -0.3273 -0.3568 0.2814 -0.1848 -0.1358 0.0052 0.0821 0.1421 -0.1939 -0.2536 0.2100 0.3262 -0.3504 -0.3235 -0.3595 -0.0706 0.0430 -0.2468 -0.1729 -0.2818 -0.2513 0.0970 0.1029 0.0971 0.0969 0.0978 0.1034 0.1003 0.0991 0.1053 0.1433 0.1438 0.1461 0.1580 0.1065 0.1074 0.1125 0.1054 0.1040 0.1028 0.1051 0.1131 0.1118 0.1010 0.1076 0.1132 0.1220 0.1234 0.1202 0.1039 0.1038 0.1001
va: 2.1386 2.1092 3.2883 2.9321 3.1361 3.6636 3.7736 3.9191 3.9179 3.9262 3.7060 4.0006 3.8887 3.6128 3.7793 3.8148 3.9941 3.9861 3.5613 4.1425 3.9326 3.9385 3.9377 3.6042 3.9747 3.9175 3.8782 3.9499 4.0869 1.0033 1.0037 1.0042 1.0036 1.0047 1.0029 1.0070 1.0009 1.0004 1.0027 1.0022 1.0059 1.0092 1.0074 1.0025 1.0033 1.0060 1.0064 1.0030 1.0048 1.0046 0.9992 1.0041 0.9892 0.9990 0.9965 1.0079 0.9909 0.9932 0.9908 1.0136
dispcorr: -0.034690460 hartree
energy: -1248.083322976998
dipole: 25.20885 -22.84780 2.36105 -16.21134 14.01638 -2.19496 9.97856 -8.44671 1.53185
magnitude: 3.56917 au
magnitude: 9.07210 debye
