program: Orca
programVersion: 5.0.2
elementType: O O N N N C C C C C C C C C C C C C C C C C C C C C C C C H H H H H H H H H H H H H H H H H H H H H H H H H H H H H H H
charge: 0
multiplicity: 1
keywords: wb97x-d3
keywords: def2-TZVPP
keywords: def2/J RIJCOSX
keywords: DEFGRID2
keywords: scfconv7
keywords: smallprint printgap noloewdin
keywords: NOSOSCF
formula: C24H31N3O2
InChI: InChI=1/C24H31N3O2/c1-15-16(2)26-27(9)20(15)21(29-22(28)24(6,7)8)19(14-25)17-10-12-18(13-11-17)23(3,4)5/h10-13H,1-9H3
60 atoms
O  -0.785861 -0.756531 0.788158
O  -0.474249 -1.735541 -1.193825
N  -3.472401 0.422246 -1.113682
N  -4.775612 0.353425 -0.920731
N  -1.495272 3.460874 -1.293292
C  5.275369 0.732358 -0.156612
C  3.766209 0.937074 -0.203781
C  5.926441 0.882747 -1.531372
C  5.902627 1.764885 0.788553
C  5.568338 -0.683372 0.35909
C  0.173384 -2.948127 0.795345
C  3.07456 1.223967 -1.375883
C  3.015379 0.828469 0.968159
C  0.958298 1.219697 -0.218863
C  -2.78577 0.305135 0.051633
C  -1.335557 0.332847 0.158374
C  1.695004 1.366001 -1.385647
C  1.640124 0.968318 0.968143
C  -0.518031 1.311101 -0.262586
C  -0.370995 -1.778719 -0.004785
C  1.266472 -3.627766 -0.031086
C  -0.999807 -3.917332 1.007612
C  0.740964 -2.523043 2.149794
C  -3.722908 0.143499 1.054084
C  -4.954932 0.194657 0.37838
C  -3.508063 -0.008014 2.520054
C  -2.962668 0.544556 -2.458323
C  -6.31699 0.096664 0.970472
C  -1.080096 2.492598 -0.826351
H  7.002087 0.72178 -1.448552
H  5.546146 0.15385 -2.248958
H  5.780129 1.880336 -1.948745
H  6.985027 1.630381 0.83573
H  5.705731 2.781617 0.446296
H  5.519296 1.679346 1.805683
H  5.126562 -1.43793 -0.293698
H  5.176335 -0.845321 1.363762
H  6.6448 -0.861526 0.396603
H  3.603784 1.333417 -2.311887
H  3.50992 0.632066 1.911462
H  1.18904 1.575936 -2.319714
H  1.094813 0.887815 1.898993
H  1.64514 -4.496489 0.508715
H  2.106238 -2.954563 -0.20964
H  0.895645 -3.965937 -0.996852
H  -1.410048 -4.262792 0.05863
H  -0.653437 -4.790909 1.56171
H  -1.805976 -3.458218 1.581525
H  -0.01635 -2.092337 2.803552
H  1.550484 -1.800294 2.039915
H  1.149612 -3.398937 2.655622
H  -2.464794 0.127677 2.799802
H  -3.813724 -0.995942 2.870933
H  -4.091628 0.724159 3.080314
H  -2.948647 1.585118 -2.778725
H  -1.958124 0.133816 -2.509906
H  -3.609118 -0.025399 -3.119722
H  -6.452338 -0.840661 1.512821
H  -7.074968 0.148914 0.191775
H  -6.504556 0.90733 1.677011
totalener: -1248.02190718 hartree
nucrepener: 2866.13924756 hartree
electener: -4114.16115474 hartree
oneelecener: -7391.10094928 hartree
twoeener: 3276.93979454 hartree
kineticenergy: 1242.44809615 hartree
xcener: -123.453115599480 hartree
chargesum: -0.0000000
charge: -0.280058 -0.336044 0.141711 -0.283650 -0.004063 0.257084 -0.053949 -0.337503 -0.288152 -0.294967 0.194082 -0.138176 -0.145965 0.056335 0.098045 0.082283 -0.128895 -0.257914 0.199561 0.276812 -0.281903 -0.308163 -0.303487 -0.096904 0.069575 -0.217037 -0.182652 -0.281941 -0.277103 0.092436 0.096598 0.098129 0.088558 0.102488 0.086983 0.097546 0.086772 0.090710 0.122097 0.113924 0.119843 0.132919 0.088759 0.094676 0.105315 0.111461 0.092749 0.100780 0.098139 0.087191 0.093926 0.081474 0.095182 0.100555 0.123292 0.118420 0.115625 0.088785 0.104816 0.092890
qa: -0.2801 -0.3360 0.1417 -0.2836 -0.0041 0.2571 -0.0539 -0.3375 -0.2882 -0.2950 0.1941 -0.1382 -0.1460 0.0563 0.0980 0.0823 -0.1289 -0.2579 0.1996 0.2768 -0.2819 -0.3082 -0.3035 -0.0969 0.0696 -0.2170 -0.1827 -0.2819 -0.2771 0.0924 0.0966 0.0981 0.0886 0.1025 0.0870 0.0975 0.0868 0.0907 0.1221 0.1139 0.1198 0.1329 0.0888 0.0947 0.1053 0.1115 0.0927 0.1008 0.0981 0.0872 0.0939 0.0815 0.0952 0.1006 0.1233 0.1184 0.1156 0.0888 0.1048 0.0929
va: 2.0885 2.1737 3.3283 2.9395 3.1339 3.7564 3.7653 3.9349 3.9204 3.9223 3.8057 3.9650 3.9951 3.5715 3.8357 3.7920 4.0760 4.0097 3.7157 4.1810 3.9420 3.9328 3.9378 3.6714 3.9396 3.9271 3.8762 3.9420 4.0111 1.0114 1.0021 1.0023 1.0060 1.0062 1.0076 1.0072 1.0071 1.0086 1.0050 1.0114 1.0137 1.0106 1.0043 1.0071 1.0181 1.0101 1.0034 1.0054 1.0100 1.0165 1.0083 1.0112 0.9940 0.9995 0.9912 0.9978 1.0140 0.9931 1.0159 0.9948
dispcorr: -0.035119192 hartree
energy: -1248.057026373105
dipole: 25.91860 -24.37835 1.54025 -18.01593 16.41701 -1.59892 10.80647 -9.58864 1.21783
magnitude: 2.53220 au
magnitude: 6.43634 debye
