program: Gaussian 09
title: 000054458
version: EM64L-G09RevD.01
frameworkgroup: C1[X(C17H21ClN2)]
method: RPBEPBE
basis: SDD
operation: Freq
keyword: #p
keyword: freq=noraman
keyword: PBEPBE/SDD
title: #p freq=noraman PBEPBE/SDD
converged: YES YES NO NO
title: Mulliken charges:
elementType: Cl N N C C C C C C C C C C C C C C C C C H H H H H H H H H H H H H H H H H H H H H
charge: -0.084290 -0.075294 -0.411399 -0.401183 -0.509431 -0.406694 0.332385 -0.332432 -0.411223 0.212027 -0.374497 0.152297 -0.350437 -0.391728 0.214282 -0.295230 -0.694176 -0.348864 -0.156059 -0.225273 0.212717 0.185567 0.220689 0.203707 0.184326 0.235607 0.165422 0.202312 0.207424 0.207238 0.202667 0.191805 0.192922 0.263927 0.308063 0.249808 0.215797 0.209448 0.211791 0.234464 0.251515
chargesum: 0.00000
title: Mulliken charges with hydrogens summed into heavy atoms:
elementType: Cl N N C C C C C C C C C C C C C C C C C
charge: -0.084290 -0.075294 -0.103336 -0.002899 -0.085035 0.013239 0.332385 0.035302 -0.203799 0.212027 0.035408 0.152297 0.034290 -0.127801 0.214282 -0.045422 -0.057140 -0.114399 -0.156059 0.026242
polarizability: 2.92330388e+02 1.54889202e-01 2.33411256e+02 -8.34945965e+00 7.91211248e+00 1.19172314e+02
1716.lowfreq: -16.8472 -6.1912 0.0016 0.0023 0.0026 3.3864 13.2690 24.3812 42.7389
frequency: 1.0615 24.3285 42.7226 53.3026 71.6570 94.3768 115.7540 126.2487 137.3178 185.7895 205.0128 216.1584 223.1895 231.9730 269.9057 288.2413 322.7999 335.5725 348.8232 351.8337 370.9079 419.9705 447.4943 472.3283 508.6229 518.0939 540.4709 574.9386 576.7592 600.6645 643.9117 689.6733 736.4746 744.2769 748.1329 771.7941 783.3964 794.5233 796.6748 808.1805 823.6471 871.1052 873.2263 896.6353 903.7109 927.9040 931.0979 958.9309 976.0902 989.4636 1019.4470 1048.2599 1059.2739 1070.8728 1079.6545 1101.1708 1110.3621 1121.1777 1129.6586 1144.0956 1148.5882 1181.2587 1197.3153 1223.5278 1229.7171 1241.7220 1252.5136 1257.6785 1278.8287 1283.2817 1286.6109 1296.9935 1305.2876 1318.6087 1334.0572 1345.7815 1360.1346 1368.8627 1388.6979 1393.1801 1396.8746 1423.2972 1448.1826 1449.5655 1460.2711 1462.2419 1462.8756 1468.5985 1474.7671 1476.5074 1481.9179 1489.1341 1537.7723 1570.1974 1626.2653 1670.7651 2775.2015 2812.9669 2841.9635 2962.4655 2968.4559 2972.4799 2976.1042 2994.5476 2999.1138 3006.0926 3021.7938 3026.4522 3043.8298 3069.6406 3071.5626 3140.6390 3147.5894 3173.6067 3186.8388 3229.7190 3614.7137
redmass: 2.5832 4.5790 4.1882 1.8422 4.0007 4.0620 3.9694 3.4443 2.8981 3.9406 5.0932 2.1454 1.9153 1.4754 3.7609 4.3242 3.6901 2.7886 9.3568 3.3833 4.3265 2.8416 2.8917 2.7204 2.8709 1.5008 3.9512 4.3411 2.9514 6.4234 3.2007 6.4525 1.1170 3.6644 3.4066 3.5717 1.7829 1.5669 1.2099 1.6932 1.4686 1.9156 3.0974 1.7880 4.0341 1.3307 1.3073 2.3193 2.1262 1.8995 2.9153 2.3234 2.0301 2.6196 2.2960 1.9571 2.2898 2.0772 1.9429 1.3209 1.8595 1.7696 1.3849 1.3745 1.3364 1.5325 1.6140 1.4926 1.2533 2.0519 1.1178 2.0917 1.7180 1.4042 1.3089 1.5592 2.0712 1.5281 1.2428 4.6774 1.5344 2.3941 3.8932 1.1136 1.0846 1.0841 4.3244 1.0676 1.0786 1.0428 1.0795 1.0900 5.3396 6.7486 7.2330 7.0378 1.0716 1.0702 1.0710 1.0586 1.0594 1.0380 1.0598 1.0817 1.0861 1.0992 1.0954 1.0929 1.1033 1.1007 1.0994 1.0897 1.0899 1.0960 1.0921 1.0975 1.0810
irintensity: 0.1215 0.7801 0.2846 0.1401 0.3947 0.2007 0.3042 1.2162 3.7511 0.8023 0.0342 0.5652 0.9138 0.9562 1.0577 1.3585 0.6110 8.0610 3.8209 1.6835 0.1495 11.8833 5.8919 6.3624 18.8380 63.8212 5.4898 7.8334 20.6283 11.2504 0.3486 18.4263 5.4343 4.9431 4.4521 18.7805 39.4489 37.8797 3.5246 19.6228 4.8432 22.4844 35.0292 7.4133 15.2276 0.5821 5.2124 22.2509 3.7947 3.3363 4.2191 13.4306 2.9694 5.5751 2.1357 30.7142 40.5103 33.5336 10.1214 3.8463 15.6009 6.7989 12.1397 2.2591 20.4581 11.6566 0.4861 9.0933 2.2250 30.6679 2.9147 17.5173 4.8762 6.6369 5.5705 0.2275 6.7838 34.9519 10.2816 49.6191 5.2470 22.2719 11.9288 2.3781 3.2787 6.6793 69.2185 0.6302 5.9839 12.2707 1.7196 19.2538 12.4496 19.5449 4.6017 1.1063 73.0930 86.8409 152.0664 24.8677 33.0270 32.3170 33.8479 41.0526 26.3999 3.8129 37.0941 51.6194 43.8008 89.7866 57.4924 9.7437 22.5756 6.0443 1.0559 1.7653 81.7152
temp: 298.150 k
press: 1.00000 atm
elementType: 17 7 7 6 6 6 6 6 6 6 6 6 6 6 6 6 6 6 6 6 1 1 1 1 1 1 1 1 1 1 1 1 1 1 1 1 1 1 1 1 1
symmnumber: 1
zpe: 896342.7 jmol-1
zpe.correction: 0.341399 hartree
zpe.thermalcorrener: 0.360764 hartree
zpe.thermalcorrenthalpy: 0.361708 hartree
zpe.thermalcorrgfe: 0.288753 hartree
zpe.sumelectzpe: -1228.479137 hartree
zpe.sumelectthermal: -1228.459772 hartree
zpe.sumelectthermalent: -1228.458828 hartree
zpe.sumelectthermalfe: -1228.531783 hartree
dipole: -0.3504 -4.2411 -0.0193
dipole: 4.2556
quadrupole: -115.4055 -115.8518 -131.9256
quadrupole: -19.0664 -7.1214 1.3882
quadrupole: 5.6554 5.2092 -10.8646 -19.0664 -7.1214 1.3882
hfenergy: -1228.8205359 hartree
pointgroup: C01 [X(C17H21Cl1N2)]
dipole: -0.0466681 1.6734827 -0.022137 debye
polarizability: 292.2290951|-3.1790537|233.8338395|7.8815982|5.4065817|118.8510235 unknown
InChI: InChI=1S/C17H21ClN2/c1-2-3-8-20-9-6-13(7-10-20)16-12-19-17-5-4-14(18)11-15(16)17/h4-6,11-12,19H,2-3,7-10H2,1H3
charge 0 multiplicity 1
41 atoms
Cl 4.110899 -3.657054 -0.323879
N  -2.948367 0.507335 -0.239607
N  3.300773 2.211671 0.437962
C  -2.292323 1.504386 -1.117019
C  -0.956123 1.962377 -0.504908
C  -2.133576 -0.72281 -0.119357
C  -0.071698 0.773151 -0.135922
C  -4.347924 0.229316 -0.64099
C  -0.652479 -0.453954 0.023071
C  1.366328 1.029214 0.056394
C  -5.134423 -0.596937 0.397872
C  2.497864 0.10026 0.074664
C  -6.636168 -0.700253 0.045458
C  1.91615 2.303026 0.270489
C  3.690328 0.873448 0.321343
C  2.63404 -1.30016 -0.131245
C  -7.427267 -1.562446 1.052777
C  4.976467 0.297341 0.393942
C  3.91962 -1.854245 -0.05813
C  5.088556 -1.094486 0.20642
H  -2.972789 2.369519 -1.226442
H  -2.105165 1.095661 -2.144729
H  -1.162786 2.570375 0.398927
H  -0.429595 2.61527 -1.229192
H  -2.293425 -1.402595 -1.004139
H  -2.476612 -1.294248 0.765433
H  -4.393508 -0.296136 -1.633848
H  -4.855513 1.205782 -0.771019
H  -0.053488 -1.321257 0.321032
H  -5.011427 -0.122294 1.391418
H  -4.716483 -1.620504 0.475514
H  -6.747291 -1.126335 -0.973061
H  -7.073152 0.318611 0.006448
H  1.410002 3.263945 0.336215
H  3.925183 2.994571 0.616292
H  1.778567 -1.936503 -0.3646
H  -8.499372 -1.613906 0.787848
H  -7.036071 -2.597043 1.081395
H  -7.350347 -1.147281 2.075318
H  5.869541 0.901687 0.585352
H  6.063052 -1.5881 0.255002
