program: Orca
programVersion: 5.0.2
elementType: O O N N N C C C C C C C C C C C C C C C C C C C C C C C C H H H H H H H H H H H H H H H H H H H H H H H H H H H H H H H
charge: 0
multiplicity: 1
keywords: wb97x-d3
keywords: def2-TZVPP
keywords: def2/J RIJCOSX
keywords: DEFGRID2
keywords: scfconv7
keywords: smallprint printgap noloewdin
keywords: NOSOSCF
formula: C24H31N3O2
InChI: InChI=1/C24H31N3O2/c1-15-16(2)26-27(9)20(15)21(29-22(28)24(6,7)8)19(14-25)17-10-12-18(13-11-17)23(3,4)5/h10-13H,1-9H3
60 atoms
O  -0.940317 -1.079446 0.311643
O  -0.002437 -1.469521 -1.687718
N  -3.747442 -0.677936 -0.548477
N  -5.011457 -0.392373 -0.293482
N  -1.547529 3.377274 -1.273666
C  5.148003 0.803071 0.287567
C  3.640079 0.923478 0.099063
C  5.606395 1.784118 1.374899
C  5.486671 -0.631671 0.713085
C  5.919531 1.114764 -0.994585
C  0.556728 -2.947778 0.131719
C  2.784227 0.683146 1.175672
C  3.053127 1.265352 -1.115479
C  0.837459 1.092384 -0.183062
C  -2.902306 0.228577 0.008768
C  -1.457668 0.134808 -0.053901
C  1.410042 0.766204 1.043693
C  1.676559 1.350368 -1.257182
C  -0.631506 1.160923 -0.336534
C  -0.118762 -1.761724 -0.537456
C  -0.134058 -4.211763 -0.399453
C  0.472525 -2.914884 1.656216
C  2.026287 -2.942806 -0.302993
C  -3.691723 1.149827 0.675516
C  -5.006665 0.70063 0.446127
C  -3.283325 2.331305 1.480011
C  -3.429726 -1.815924 -1.372626
C  -6.271361 1.316968 0.93146
C  -1.168103 2.37521 -0.848585
H  6.685925 1.713954 1.521703
H  5.371458 2.813346 1.100999
H  5.133612 1.583615 2.336808
H  5.175965 -1.350874 -0.046579
H  6.562785 -0.743684 0.859279
H  4.999454 -0.908491 1.648733
H  5.66292 0.430904 -1.805263
H  6.99061 1.014101 -0.814231
H  5.744052 2.134628 -1.340742
H  3.193253 0.431838 2.14657
H  3.666238 1.468174 -1.981983
H  0.776913 0.590546 1.90445
H  1.252954 1.60708 -2.219552
H  -1.184718 -4.252412 -0.10567
H  0.354331 -5.096204 0.011753
H  -0.078764 -4.271454 -1.486098
H  0.947591 -2.025024 2.069676
H  -0.552995 -2.954558 2.021319
H  0.997992 -3.781572 2.060105
H  2.126927 -2.995849 -1.385603
H  2.537123 -3.80476 0.128502
H  2.538511 -2.042651 0.040787
H  -2.258551 2.243158 1.840651
H  -3.930939 2.450086 2.349369
H  -3.338704 3.253015 0.897681
H  -2.652069 -1.566621 -2.091273
H  -3.106541 -2.668701 -0.774192
H  -4.330918 -2.091791 -1.911347
H  -7.128697 0.730475 0.607678
H  -6.392506 2.332243 0.550885
H  -6.295854 1.37592 2.021133
totalener: -1248.02139385 hartree
nucrepener: 2882.09159897 hartree
electener: -4130.11299282 hartree
oneelecener: -7422.97549962 hartree
twoeener: 3292.86250680 hartree
kineticenergy: 1242.43626064 hartree
xcener: -123.455089652041 hartree
chargesum: 0.0000000
charge: -0.264422 -0.302615 0.125052 -0.288457 -0.016614 0.296666 -0.075899 -0.288978 -0.319603 -0.341310 0.209924 -0.165548 -0.110817 0.091055 0.110879 0.126326 -0.262654 -0.108807 0.120818 0.187787 -0.322630 -0.299390 -0.267146 -0.089170 0.067645 -0.223750 -0.194894 -0.284714 -0.249516 0.089199 0.102544 0.087493 0.095905 0.095300 0.093324 0.096418 0.091882 0.099624 0.108128 0.121936 0.133916 0.121165 0.094667 0.096019 0.116698 0.090628 0.101182 0.093025 0.110134 0.092199 0.058237 0.094017 0.093072 0.118708 0.129333 0.100413 0.122962 0.102148 0.101083 0.089423
qa: -0.2644 -0.3026 0.1251 -0.2885 -0.0166 0.2967 -0.0759 -0.2890 -0.3196 -0.3413 0.2099 -0.1655 -0.1108 0.0911 0.1109 0.1263 -0.2627 -0.1088 0.1208 0.1878 -0.3226 -0.2994 -0.2671 -0.0892 0.0676 -0.2238 -0.1949 -0.2847 -0.2495 0.0892 0.1025 0.0875 0.0959 0.0953 0.0933 0.0964 0.0919 0.0996 0.1081 0.1219 0.1339 0.1212 0.0947 0.0960 0.1167 0.0906 0.1012 0.0930 0.1101 0.0922 0.0582 0.0940 0.0931 0.1187 0.1293 0.1004 0.1230 0.1021 0.1011 0.0894
va: 2.1061 2.1922 3.3249 2.9506 3.1351 3.7179 3.7584 3.9199 3.9285 3.9372 3.7946 3.9924 3.9273 3.5741 3.8028 3.7651 3.9975 4.0490 3.7569 4.2863 3.9247 3.9430 3.9452 3.7032 3.9256 3.9058 3.8931 3.9431 4.0212 1.0060 1.0062 1.0075 1.0054 1.0109 1.0043 1.0016 1.0116 1.0021 1.0165 1.0048 1.0063 1.0161 1.0063 1.0059 1.0098 1.0107 1.0113 1.0050 1.0186 1.0063 1.0163 1.0004 1.0029 0.9965 1.0001 0.9871 1.0143 1.0158 0.9911 0.9952
dispcorr: -0.036719875 hartree
energy: -1248.058113722217
dipole: 27.82339 -26.38630 1.43709 -13.55538 11.97665 -1.57873 10.23002 -9.13355 1.09647
magnitude: 2.39997 au
magnitude: 6.10024 debye
