program: Gaussian 09
title: 000054472
version: EM64L-G09RevD.01
frameworkgroup: C1[X(C13H13IN2O4)]
method: RPBEPBE
basis: SDD
operation: Freq
keyword: #p
keyword: freq=noraman
keyword: PBEPBE/SDD
title: #p freq=noraman PBEPBE/SDD
converged: YES YES NO NO
title: Mulliken charges:
elementType: I O O O O N N C C C C C C C C C C C C C H H H H H H H H H H H H H
charge: 0.037937 -0.467783 -0.234254 -0.230778 -0.225115 -0.369322 -0.361356 -0.018904 -0.491119 0.392967 0.044471 0.224623 0.147554 -0.849292 -0.376825 -0.375199 0.157472 -0.238821 -0.247866 -0.237585 0.263272 0.249123 0.266243 0.316005 0.299011 0.363515 0.363394 0.258667 0.280983 0.362211 0.231075 0.231449 0.234247
chargesum: 0.00000
title: Mulliken charges with hydrogens summed into heavy atoms:
elementType: I O O O O N N C C C C C C C C C C C C C
charge: 0.037937 -0.105572 -0.234254 -0.230778 -0.225115 -0.005807 0.002039 -0.018904 0.021275 0.392967 0.310714 0.224623 0.147554 -0.234276 -0.118158 -0.094216 0.157472 -0.007746 -0.016417 -0.003337
polarizability: 2.31680202e+02 -2.45579516e+01 1.75221652e+02 -6.42299083e-01 -9.38307628e+00 1.53389698e+02
1716.lowfreq: -6.6224 -3.8835 0.0003 0.0004 0.0006 6.9183 22.9131 29.7560 37.4688
frequency: 22.6982 29.5963 37.4618 45.7245 73.8971 91.6347 120.4691 138.8175 169.2311 175.6283 184.5779 194.3637 227.6320 245.9487 273.0379 312.7165 359.6162 363.5803 366.8254 401.1533 412.3508 430.2605 484.4441 490.5394 524.1458 550.6590 581.4420 613.3640 615.5932 634.7775 649.2094 677.2637 699.7185 704.7370 749.1211 756.9563 767.8095 784.5476 798.7872 829.7295 858.1548 914.1186 915.6616 936.5376 985.2139 990.3552 994.1541 1001.4507 1006.8216 1033.0383 1039.1266 1074.7582 1092.0096 1104.9350 1151.8811 1153.0022 1177.6003 1195.3327 1209.8473 1214.7991 1224.8777 1285.7478 1301.4672 1320.6499 1332.7770 1351.2941 1369.2401 1374.6003 1377.5941 1377.7781 1380.5437 1419.4041 1435.8818 1448.1404 1483.2179 1589.1641 1607.0704 1612.6139 1650.0941 1678.0185 3008.4300 3026.2861 3056.3360 3098.1538 3129.5778 3138.6896 3148.7702 3151.0948 3159.7543 3170.3561 3518.7879 3522.8463 3527.1727
redmass: 5.4204 5.3559 12.1878 6.9773 3.5540 9.2646 5.2409 5.6256 7.7760 11.2766 6.5558 5.3655 5.8267 6.2074 2.7989 4.6555 2.7116 4.4994 1.9615 2.8687 5.6557 2.4144 4.9361 9.1132 4.2867 5.0417 4.0785 6.5942 6.1985 4.2373 2.5533 2.4666 7.2939 1.9114 1.8904 3.7263 2.0093 1.8865 2.5301 1.8878 1.2450 2.3114 5.0119 1.4951 1.6363 3.5212 3.6126 1.4023 2.0818 2.4617 2.0184 4.1234 2.1281 2.8747 3.5280 1.6608 1.0562 1.2041 1.1411 1.8204 1.8823 1.4115 1.4084 2.5131 1.4305 1.4305 4.7381 1.8828 1.5247 3.0529 2.0505 1.1264 2.2030 1.1068 2.0461 5.9287 5.7792 6.7351 8.8027 5.4462 1.0859 1.0606 1.0562 1.1024 1.0850 1.0884 1.1104 1.0929 1.0954 1.1008 1.0656 1.0764 1.0774
irintensity: 0.0341 0.0722 0.3701 0.1065 0.2568 1.3172 1.3261 0.1050 0.5029 16.6247 0.4679 5.1226 0.5178 2.2116 1.7364 0.8928 21.3202 18.1688 118.5294 0.0240 24.4430 12.2858 17.3937 15.7971 62.7137 12.6134 13.9026 2.5791 1.4080 3.2252 1.3073 29.5951 1.6614 44.7053 4.5301 5.5072 36.6877 224.6448 10.1880 9.7448 0.5963 2.7151 26.8774 5.4822 1.7563 3.0895 2.3299 7.1221 30.1297 18.2712 5.0816 25.2861 12.7944 14.2827 3.4600 4.0472 0.4580 43.0305 6.9511 30.1023 39.1325 8.9695 80.3826 237.1003 26.9257 56.5726 180.0340 7.2021 24.3337 4.7081 7.7943 9.6723 14.2868 23.6138 36.8472 4.4949 12.8944 255.0166 94.5801 638.7765 12.5385 6.5062 6.8037 3.7355 0.1630 9.2447 1.5616 7.7047 16.2303 22.9174 17.7954 74.1534 60.5806
temp: 298.150 k
press: 1.00000 atm
elementType: 53 8 8 8 8 7 7 6 6 6 6 6 6 6 6 6 6 6 6 6 1 1 1 1 1 1 1 1 1 1 1 1 1
symmnumber: 1
zpe: 645476.8 jmol-1
zpe.correction: 0.245849 hartree
zpe.thermalcorrener: 0.264481 hartree
zpe.thermalcorrenthalpy: 0.265425 hartree
zpe.thermalcorrgfe: 0.195951 hartree
zpe.sumelectzpe: -923.678648 hartree
zpe.sumelectthermal: -923.660017 hartree
zpe.sumelectthermalent: -923.659072 hartree
zpe.sumelectthermalfe: -923.728547 hartree
dipole: 1.0074 -2.3677 -0.3601
dipole: 2.5981
quadrupole: -125.8296 -135.4117 -134.7774
quadrupole: -11.8232 -1.7425 -3.1265
quadrupole: 6.1766 -3.4055 -2.7711 -11.8232 -1.7425 -3.1265
hfenergy: -923.9244975 hartree
pointgroup: C01 [X(C13H13I1N2O4)]
dipole: -0.6890875 -0.7021474 0.2775219 debye
polarizability: 240.1082049|3.0641151|169.7226306|7.7794829|5.1899543|150.4607172 unknown
InChI: InChI=1S/C13H13IN2O4/c14-7-9(17)6-13(8-4-2-1-3-5-8)10(18)15-12(20)16-11(13)19/h1-5,9,15-17H,6-7H2
charge 0 multiplicity 1
33 atoms
I  5.253386 -2.1513 0.948563
O  2.703414 -0.01582 -0.122106
O  0.535218 -0.601839 -2.382992
O  0.493254 0.762823 2.228605
O  0.532793 3.883647 -1.201717
N  0.419236 1.617298 -1.763421
N  0.385894 2.288091 0.499093
C  0.018972 -0.136399 -0.012081
C  0.79683 -1.432173 0.378976
C  -1.517779 -0.438466 0.0243
C  2.292716 -1.167179 0.699863
C  0.378832 0.245663 -1.467988
C  0.344569 0.977878 0.996501
C  3.116382 -2.416075 0.377551
C  -2.348567 0.046609 1.066361
C  -2.086976 -1.270791 -0.97572
C  0.443398 2.681341 -0.850145
C  -3.722248 -0.283922 1.098624
C  -3.458484 -1.60161 -0.936048
C  -4.284358 -1.108299 0.099433
H  0.319624 -1.880208 1.265684
H  0.695545 -2.133415 -0.468668
H  2.393583 -0.902278 1.770541
H  3.140538 -2.622379 -0.703269
H  2.783204 -3.296707 0.947671
H  0.550405 1.874042 -2.746846
H  0.502107 3.041926 1.183984
H  -1.934692 0.666839 1.867076
H  -1.462457 -1.650562 -1.791043
H  3.658175 0.187498 0.059397
H  -4.349389 0.102108 1.909757
H  -3.880332 -2.243104 -1.71758
H  -5.34939 -1.363135 0.127343
