program: Orca
programVersion: 5.0.2
elementType: Cl F F F O O N N N N N N N N N N C C C C C C C C C C C C C C C C C C C C C C H H H H H H H H H H H H H H H H
charge: 0
multiplicity: 1
keywords: wb97x-d3
keywords: def2-TZVPP
keywords: def2/J RIJCOSX
keywords: DEFGRID2
keywords: scfconv7
keywords: smallprint printgap noloewdin
keywords: NOSOSCF
formula: C22H16ClF3N10O2
InChI: InChI=1/C22H16ClF3N10O2/c1-11-6-12(9-27)7-14(19(37)28-2)17(11)30-20(38)16-8-13(10-35-33-21(31-34-35)22(24,25)26)32-36(16)18-15(23)4-3-5-29-18/h3-8,28,30H,10H2,1-2H3
54 atoms
Cl 0.752297 -1.855886 2.169093
F  -6.304212 -0.335026 -0.886278
F  -5.207308 1.262512 -1.834451
F  -4.473106 -0.761388 -1.922002
O  1.887558 3.577946 -1.075873
O  -1.203253 -0.387646 -0.788318
N  1.018238 1.102823 1.286545
N  2.352786 1.440824 -1.568443
N  -0.02118 1.053333 2.11038
N  -3.181867 1.176676 1.562244
N  3.310993 1.092568 1.439517
N  -3.722446 1.482121 0.41713
N  -3.406446 -0.048198 1.94495
N  -0.432272 0.820874 -2.524936
N  -4.14094 -0.590667 1.034258
N  2.351472 -5.205819 -0.481821
C  0.836461 2.017165 0.290129
C  -0.894021 1.917236 1.638321
C  2.29942 0.045196 -1.443019
C  -0.397851 2.572132 0.500738
C  -2.241844 2.050068 2.256842
C  1.748127 2.394774 -0.817714
C  3.524213 -0.642112 -1.428943
C  1.084943 -0.646489 -1.354795
C  2.201431 0.397387 1.586159
C  3.512207 -2.008599 -1.216053
C  1.102429 -2.011889 -1.110031
C  2.31087 -2.686904 -1.0285
C  4.821324 0.075119 -1.641793
C  -0.278676 -0.036788 -1.51711
C  2.190567 -0.932929 2.002079
C  3.40934 -1.540897 2.255914
C  -4.314712 0.356177 0.111736
C  4.474441 0.501101 1.670477
C  4.57413 -0.814344 2.086897
C  2.327192 -4.079617 -0.731139
C  -5.083415 0.134692 -1.143578
C  -1.689555 1.480059 -2.795335
H  -0.888831 3.315689 -0.10545
H  -2.620805 3.066758 2.187199
H  -2.235459 1.750137 3.301907
H  3.04486 1.808911 -2.211471
H  4.448303 -2.549624 -1.171176
H  0.173908 -2.555031 -1.002478
H  5.661762 -0.585332 -1.439817
H  4.913136 0.417028 -2.675799
H  4.923986 0.952745 -1.005022
H  3.442982 -2.575317 2.569626
H  0.348004 1.022058 -3.129641
H  5.36028 1.106154 1.528699
H  5.539039 -1.26357 2.272281
H  -2.429856 0.790714 -3.20253
H  -1.511583 2.261592 -3.528634
H  -2.094662 1.942668 -1.896388
elementType: Cl F O N C H
totalener: -2305.86270457 hartree
nucrepener: 4815.56614232 hartree
electener: -7121.42884689 hartree
twoeener: 5623.40866863 hartree
cpcmener: -0.08227574 hartree
kineticenergy: 2298.18134475 hartree
xcener: -190.417003787600 hartree
chargesum: 0.0000000
charge: -0.052026 -0.164628 -0.164941 -0.167117 -0.474742 -0.554331 0.242884 -0.145467 -0.307943 0.275285 -0.361742 -0.272159 -0.124941 -0.109479 -0.201337 -0.113569 0.037342 -0.049507 0.181819 -0.149524 -0.001038 0.281431 -0.095358 0.090782 0.193357 -0.135360 -0.267198 0.219342 -0.259048 0.280273 0.047206 -0.085566 0.045783 -0.008757 -0.106304 -0.134740 0.524390 -0.182280 0.186603 0.148940 0.132290 0.188396 0.138000 0.136315 0.106968 0.129973 0.111984 0.144647 0.183821 0.154261 0.164065 0.117261 0.128438 0.097247
qa: -0.0520 -0.1646 -0.1649 -0.1671 -0.4747 -0.5543 0.2429 -0.1455 -0.3079 0.2753 -0.3617 -0.2722 -0.1249 -0.1095 -0.2013 -0.1136 0.0373 -0.0495 0.1818 -0.1495 -0.0010 0.2814 -0.0954 0.0908 0.1934 -0.1354 -0.2672 0.2193 -0.2590 0.2803 0.0472 -0.0856 0.0458 -0.0088 -0.1063 -0.1347 0.5244 -0.1823 0.1866 0.1489 0.1323 0.1884 0.1380 0.1363 0.1070 0.1300 0.1120 0.1446 0.1838 0.1543 0.1641 0.1173 0.1284 0.0972
va: 1.2601 1.1456 1.1460 1.1351 2.0332 1.9500 3.2960 3.1996 2.8832 3.4274 3.0425 2.9089 2.8487 3.2496 2.9872 3.1313 3.6831 3.9969 3.6707 3.8565 3.8467 4.2939 3.8078 3.5542 3.9157 3.9141 3.9870 3.6311 3.9148 4.1544 3.9162 3.9280 4.1420 3.9974 3.8430 4.0207 4.4997 3.8985 0.9914 0.9974 1.0149 1.0126 1.0115 1.0386 1.0012 0.9919 0.9957 1.0085 1.0026 0.9934 0.9886 0.9987 1.0000 0.9962
dispcorr: -0.044488877 hartree
energy: -2305.907193443185
dipole: 38.55417 -34.07212 4.48204 10.50220 -8.06484 2.43735 -7.53820 5.97778 -1.56041
magnitude: 5.33520 au
magnitude: 13.56099 debye
