program: Orca
programVersion: 5.0.2
elementType: Cl F F F O O N N N N N N N N N N C C C C C C C C C C C C C C C C C C C C C C H H H H H H H H H H H H H H H H
charge: 0
multiplicity: 1
keywords: wb97x-d3
keywords: def2-TZVPP
keywords: def2/J RIJCOSX
keywords: DEFGRID2
keywords: scfconv7
keywords: smallprint printgap noloewdin
keywords: NOSOSCF
formula: C22H16ClF3N10O2
InChI: InChI=1/C22H16ClF3N10O2/c1-11-6-12(9-27)7-14(19(37)28-2)17(11)30-20(38)16-8-13(10-35-33-21(31-34-35)22(24,25)26)32-36(16)18-15(23)4-3-5-29-18/h3-8,28,30H,10H2,1-2H3
54 atoms
Cl 2.574516 1.193715 4.239708
F  -5.29118 -2.012469 -1.922475
F  -3.840538 -3.347205 -1.055885
F  -5.522825 -2.698649 0.110367
O  3.74731 0.148988 0.969719
O  2.317103 1.303065 -2.12043
N  1.317631 1.569303 1.585405
N  2.593718 -1.122412 -0.487605
N  0.084417 1.853734 1.981574
N  -2.805084 0.139323 0.836974
N  2.639114 3.396107 0.972844
N  -3.444105 -0.992282 0.908877
N  -2.805689 0.671389 -0.352768
N  0.13949 1.847044 -1.801638
N  -3.478725 -0.122718 -1.114357
N  -2.818615 -2.827235 -4.138743
C  1.404011 0.34077 1.014016
C  -0.636996 0.791369 1.681389
C  1.487873 -1.449144 -1.29054
C  0.143656 -0.201874 1.079119
C  -2.09916 0.742171 1.960875
C  2.6776 -0.193835 0.493129
C  1.154967 -2.804129 -1.404971
C  0.73726 -0.464177 -1.945838
C  2.358579 2.488366 1.878908
C  0.043216 -3.156658 -2.155005
C  -0.379731 -0.838256 -2.674931
C  -0.728926 -2.180108 -2.773611
C  1.958391 -3.852633 -0.701123
C  1.145186 0.980613 -1.94574
C  2.996026 2.41715 3.110493
C  3.98087 3.345137 3.399436
C  -3.856454 -1.129874 -0.327762
C  3.586184 4.285902 1.244295
C  4.280599 4.299451 2.442131
C  -1.884612 -2.544509 -3.523715
C  -4.637397 -2.306275 -0.803242
C  0.275074 3.283543 -1.863112
H  -0.179529 -1.173084 0.742745
H  -2.501762 1.738494 2.133931
H  -2.325345 0.127832 2.829957
H  3.456842 -1.618597 -0.680405
H  -0.233689 -4.199192 -2.241832
H  -0.970127 -0.098033 -3.19709
H  2.994228 -3.869162 -1.045738
H  1.979197 -3.681122 0.376023
H  1.538687 -4.84113 -0.875352
H  4.502769 3.322997 4.346216
H  -0.769438 1.4888 -1.545711
H  3.794583 5.019078 0.476334
H  5.043131 5.042856 2.625274
H  1.301966 3.559147 -2.078744
H  -0.018438 3.738497 -0.918642
H  -0.360966 3.688124 -2.649821
elementType: Cl F O N C H
totalener: -2305.86430528 hartree
nucrepener: 4665.65036181 hartree
electener: -6971.51466708 hartree
twoeener: 5472.53727629 hartree
cpcmener: -0.07784636 hartree
kineticenergy: 2298.14486090 hartree
xcener: -190.402445591138 hartree
chargesum: 0.0000000
charge: -0.052604 -0.164192 -0.166089 -0.162517 -0.479015 -0.527331 0.234850 -0.120182 -0.276023 0.268148 -0.339836 -0.272853 -0.142471 -0.182258 -0.207970 -0.114221 -0.164544 -0.052911 0.032993 0.003520 0.010406 0.303210 -0.029938 0.067945 0.163321 -0.123036 -0.236037 0.231532 -0.242738 0.319582 0.018959 -0.082486 0.093407 0.007581 -0.103355 -0.149966 0.513749 -0.163511 0.186763 0.139904 0.135929 0.184215 0.141855 0.144174 0.114535 0.114206 0.099216 0.150636 0.220416 0.148588 0.167426 0.104262 0.108186 0.126570
qa: -0.0526 -0.1642 -0.1661 -0.1625 -0.4790 -0.5273 0.2348 -0.1202 -0.2760 0.2681 -0.3398 -0.2729 -0.1425 -0.1823 -0.2080 -0.1142 -0.1645 -0.0529 0.0330 0.0035 0.0104 0.3032 -0.0299 0.0679 0.1633 -0.1230 -0.2360 0.2315 -0.2427 0.3196 0.0190 -0.0825 0.0934 0.0076 -0.1034 -0.1500 0.5137 -0.1635 0.1868 0.1399 0.1359 0.1842 0.1419 0.1442 0.1145 0.1142 0.0992 0.1506 0.2204 0.1486 0.1674 0.1043 0.1082 0.1266
va: 1.2663 1.1455 1.1306 1.1486 2.0226 1.9839 3.2980 3.2172 2.9030 3.4243 3.0467 2.9407 2.8247 3.2119 2.9415 3.1204 3.7857 3.9964 3.8047 3.6442 3.8150 4.2508 3.8446 3.5216 3.8898 3.9723 4.0309 3.6192 3.9159 4.1500 4.0491 3.9746 4.0968 4.0263 3.8796 4.0070 4.4937 3.8679 0.9747 1.0059 0.9998 1.0103 1.0102 1.0348 0.9927 0.9973 1.0042 1.0035 0.9895 0.9952 0.9863 1.0222 0.9989 0.9960
dispcorr: -0.039214305 hartree
energy: -2305.903519580391
dipole: 26.84659 -25.82548 1.02111 13.54832 -13.09028 0.45805 -4.97596 7.85021 2.87425
magnitude: 3.08444 au
magnitude: 7.84003 debye
