program: Orca
programVersion: 5.0.2
elementType: Cl F F F O O N N N N N N N N N N C C C C C C C C C C C C C C C C C C C C C C H H H H H H H H H H H H H H H H
charge: 0
multiplicity: 1
keywords: wb97x-d3
keywords: def2-TZVPP
keywords: def2/J RIJCOSX
keywords: DEFGRID2
keywords: scfconv7
keywords: smallprint printgap noloewdin
keywords: NOSOSCF
formula: C22H16ClF3N10O2
InChI: InChI=1/C22H16ClF3N10O2/c1-11-6-12(9-27)7-14(19(37)28-2)17(11)30-20(38)16-8-13(10-35-33-21(31-34-35)22(24,25)26)32-36(16)18-15(23)4-3-5-29-18/h3-8,28,30H,10H2,1-2H3
54 atoms
Cl -0.3303 -1.790622 0.317682
F  -3.691158 -2.391372 2.320994
F  -5.204244 -1.082303 3.110848
F  -5.585147 -2.230517 1.322795
O  2.774596 3.858277 0.073497
O  1.378725 2.361327 -3.088197
N  0.645687 1.124948 0.776224
N  3.228372 1.871242 -0.861233
N  -0.665725 1.112807 0.990141
N  -3.329656 1.325809 0.571459
N  2.542572 0.464331 1.892638
N  -3.66387 0.687632 1.655114
N  -3.561336 0.663721 -0.526524
N  -0.408525 1.101754 -2.553674
N  -4.091116 -0.45763 -0.177815
N  1.895607 -4.499651 -2.585563
C  1.055053 2.297727 0.21289
C  -1.115527 2.261616 0.54284
C  2.958565 0.574696 -1.313509
C  -0.071285 3.063738 0.057772
C  -2.576722 2.565326 0.573259
C  2.420784 2.720722 -0.186391
C  3.90891 -0.416489 -1.029474
C  1.794025 0.272997 -2.03433
C  1.444716 0.078129 1.275263
C  3.626468 -1.724702 -1.384765
C  1.529497 -1.04636 -2.366712
C  2.433923 -2.042979 -2.02494
C  5.210648 -0.079854 -0.370398
C  0.903178 1.348374 -2.584729
C  1.091094 -1.263494 1.131234
C  1.950633 -2.21768 1.648852
C  -4.141374 -0.422626 1.153513
C  3.367487 -0.454171 2.373956
C  3.112143 -1.810103 2.279971
C  2.135762 -3.399025 -2.33925
C  -4.662606 -1.539989 1.985816
C  -1.371284 2.051048 -3.061638
H  -0.137059 4.041234 -0.390499
H  -2.872055 3.143358 -0.299913
H  -2.862399 3.128875 1.460102
H  4.179752 2.202369 -0.97009
H  4.335398 -2.506438 -1.145855
H  0.637188 -1.306701 -2.919582
H  5.725725 -0.982404 -0.049792
H  5.870489 0.445449 -1.064779
H  5.086849 0.563938 0.498218
H  1.71606 -3.268448 1.547903
H  -0.752289 0.33349 -1.997955
H  4.260837 -0.090574 2.864694
H  3.803037 -2.532388 2.68888
H  -1.316137 3.007653 -2.540162
H  -2.365129 1.63921 -2.921646
H  -1.22359 2.230641 -4.125729
elementType: Cl F O N C H
totalener: -2305.86061471 hartree
nucrepener: 4796.19539101 hartree
electener: -7102.05600572 hartree
twoeener: 5601.19299898 hartree
cpcmener: -0.07722892 hartree
kineticenergy: 2298.22280753 hartree
xcener: -190.427184812008 hartree
chargesum: -0.0000000
charge: -0.062562 -0.165911 -0.162186 -0.161993 -0.478481 -0.524240 0.255908 -0.109841 -0.353912 0.273756 -0.360409 -0.264637 -0.121041 -0.152247 -0.216783 -0.112337 0.021307 0.008304 0.137437 -0.169216 0.000469 0.287893 -0.037521 0.016562 0.188578 -0.158067 -0.265593 0.226032 -0.257432 0.326220 0.057614 -0.093075 0.073344 -0.009927 -0.106439 -0.134731 0.496535 -0.199105 0.181999 0.144445 0.148741 0.185880 0.137702 0.142004 0.106758 0.131572 0.110923 0.147201 0.191229 0.154422 0.164325 0.114898 0.117975 0.127655
qa: -0.0626 -0.1659 -0.1622 -0.1620 -0.4785 -0.5242 0.2559 -0.1098 -0.3539 0.2738 -0.3604 -0.2646 -0.1210 -0.1522 -0.2168 -0.1123 0.0213 0.0083 0.1374 -0.1692 0.0005 0.2879 -0.0375 0.0166 0.1886 -0.1581 -0.2656 0.2260 -0.2574 0.3262 0.0576 -0.0931 0.0733 -0.0099 -0.1064 -0.1347 0.4965 -0.1991 0.1820 0.1444 0.1487 0.1859 0.1377 0.1420 0.1068 0.1316 0.1109 0.1472 0.1912 0.1544 0.1643 0.1149 0.1180 0.1277
va: 1.2498 1.1338 1.1464 1.1467 2.0301 1.9893 3.2418 3.1958 2.8333 3.4365 3.0441 2.9373 2.8545 3.1974 2.9684 3.1318 3.6895 3.9391 3.6957 3.8560 3.8327 4.3022 3.7830 3.5758 3.9131 3.9298 4.0072 3.6333 3.9082 4.1424 3.8904 3.9343 4.1208 3.9998 3.8421 4.0245 4.5296 3.8935 0.9969 0.9963 0.9966 1.0110 1.0121 1.0305 1.0009 0.9916 0.9967 1.0062 1.0054 0.9935 0.9884 0.9884 1.0075 0.9995
dispcorr: -0.043985178 hartree
energy: -2305.904599893033
dipole: 36.46862 -34.82541 1.64321 17.32483 -17.24172 0.08311 -15.61872 16.83652 1.21780
magnitude: 2.04697 au
magnitude: 5.20299 debye
