program: Orca
programVersion: 5.0.2
elementType: Cl F F F O O N N N N N N N N N N C C C C C C C C C C C C C C C C C C C C C C H H H H H H H H H H H H H H H H
charge: 0
multiplicity: 1
keywords: wb97x-d3
keywords: def2-TZVPP
keywords: def2/J RIJCOSX
keywords: DEFGRID2
keywords: scfconv7
keywords: smallprint printgap noloewdin
keywords: NOSOSCF
formula: C22H16ClF3N10O2
InChI: InChI=1/C22H16ClF3N10O2/c1-11-6-12(9-27)7-14(19(37)28-2)17(11)30-20(38)16-8-13(10-35-33-21(31-34-35)22(24,25)26)32-36(16)18-15(23)4-3-5-29-18/h3-8,28,30H,10H2,1-2H3
54 atoms
Cl 3.473126 2.347966 1.268324
F  -4.809718 -1.584342 1.0040
F  -6.643762 -0.45996 0.973538
F  -5.640292 -0.911069 -0.87332
O  2.146368 -0.89355 0.615323
O  -0.804854 0.050156 -3.138197
N  0.818258 1.180369 2.115402
N  1.551725 0.200398 -1.284115
N  -0.19832 1.874534 2.61573
N  -3.385248 2.1107 1.118117
N  1.667217 0.13705 4.004951
N  -3.753675 0.898422 1.418648
N  -4.007814 2.616579 0.09183
N  -1.211844 -1.966261 -2.214867
N  -4.840352 1.719739 -0.313877
N  3.446526 -4.56534 -5.666849
C  0.65624 0.919908 0.793558
C  -1.026163 2.06371 1.610162
C  1.990202 -0.792232 -2.188005
C  -0.537415 1.487195 0.427016
C  -2.303797 2.804561 1.797642
C  1.536256 -0.001853 0.049803
C  3.344751 -1.097585 -2.320282
C  1.016975 -1.460801 -2.937065
C  1.922642 0.867699 2.942116
C  3.698302 -2.089084 -3.229367
C  1.382022 -2.444336 -3.834937
C  2.733213 -2.751908 -3.977648
C  4.409525 -0.390949 -1.54191
C  -0.419608 -1.060341 -2.77871
C  3.191678 1.350107 2.642333
C  4.239389 1.022059 3.484871
C  -4.66489 0.682403 0.505101
C  2.667605 -0.164091 4.821954
C  3.970887 0.246379 4.598491
C  3.130201 -3.753336 -4.911262
C  -5.443783 -0.582164 0.402717
C  -2.599266 -1.688446 -1.913738
H  -1.014438 1.450753 -0.540317
H  -2.260804 3.802532 1.364944
H  -2.553096 2.899209 2.852748
H  0.964055 0.933014 -1.65905
H  4.743063 -2.338753 -3.362471
H  0.636984 -2.96508 -4.421442
H  4.14953 0.647825 -1.346166
H  4.581463 -0.874485 -0.579672
H  5.351529 -0.407671 -2.087323
H  5.240617 1.375714 3.280501
H  -0.811697 -2.838535 -1.905146
H  2.41901 -0.762336 5.688605
H  4.760084 -0.029543 5.282833
H  -3.154389 -1.419026 -2.810866
H  -2.688938 -0.877287 -1.189972
H  -3.041815 -2.584233 -1.490339
elementType: Cl F O N C H
totalener: -2305.87307978 hartree
nucrepener: 4431.61613064 hartree
electener: -6737.48921042 hartree
twoeener: 5237.30157468 hartree
cpcmener: -0.07332760 hartree
kineticenergy: 2298.18191608 hartree
xcener: -190.400782160549 hartree
chargesum: -0.0000000
charge: -0.054832 -0.165282 -0.166087 -0.166072 -0.486013 -0.545722 0.201733 -0.156713 -0.306890 0.247202 -0.343745 -0.267231 -0.119595 -0.165703 -0.210860 -0.120748 0.003141 0.008598 0.201658 -0.195090 0.016471 0.327176 -0.043963 -0.053951 0.170566 -0.127326 -0.140787 0.205935 -0.255009 0.313026 0.029446 -0.082942 0.076945 0.016949 -0.118725 -0.126301 0.515749 -0.159297 0.168004 0.130946 0.138850 0.196058 0.139891 0.150159 0.097185 0.113421 0.111805 0.153394 0.195268 0.152174 0.167665 0.114192 0.094371 0.120907
qa: -0.0548 -0.1653 -0.1661 -0.1661 -0.4860 -0.5457 0.2017 -0.1567 -0.3069 0.2472 -0.3437 -0.2672 -0.1196 -0.1657 -0.2109 -0.1207 0.0031 0.0086 0.2017 -0.1951 0.0165 0.3272 -0.0440 -0.0540 0.1706 -0.1273 -0.1408 0.2059 -0.2550 0.3130 0.0294 -0.0829 0.0769 0.0169 -0.1187 -0.1263 0.5157 -0.1593 0.1680 0.1309 0.1388 0.1961 0.1399 0.1502 0.0972 0.1134 0.1118 0.1534 0.1953 0.1522 0.1677 0.1142 0.0944 0.1209
va: 1.2633 1.1430 1.1394 1.1388 2.0099 1.9568 3.3065 3.2130 2.9517 3.4510 3.0646 2.9252 2.8476 3.2197 2.9840 3.1271 3.8420 4.0328 3.7008 3.9025 3.8174 4.1577 3.8787 3.8129 3.9922 3.9820 4.0254 3.6673 3.8813 4.1869 3.9385 3.9700 4.1032 4.0175 3.8840 4.0142 4.4987 3.9130 1.0073 1.0020 1.0054 1.0112 1.0110 1.0161 1.0106 1.0034 1.0049 1.0032 0.9930 0.9959 0.9866 0.9942 0.9834 1.0008
dispcorr: -0.033335088 hartree
energy: -2305.906414869755
dipole: 27.92675 -25.97912 1.94762 -3.87052 5.00748 1.13697 -5.13812 7.48206 2.34394
magnitude: 3.25269 au
magnitude: 8.26768 debye
