program: Orca
programVersion: 5.0.2
elementType: Cl F F F O O N N N N N N N N N N C C C C C C C C C C C C C C C C C C C C C C H H H H H H H H H H H H H H H H
charge: 0
multiplicity: 1
keywords: wb97x-d3
keywords: def2-TZVPP
keywords: def2/J RIJCOSX
keywords: DEFGRID2
keywords: scfconv7
keywords: smallprint printgap noloewdin
keywords: NOSOSCF
formula: C22H16ClF3N10O2
InChI: InChI=1/C22H16ClF3N10O2/c1-11-6-12(9-27)7-14(19(37)28-2)17(11)30-20(38)16-8-13(10-35-33-21(31-34-35)22(24,25)26)32-36(16)18-15(23)4-3-5-29-18/h3-8,28,30H,10H2,1-2H3
54 atoms
Cl 2.503946 2.008193 4.104957
F  -3.755394 0.000276 -2.534037
F  -3.927559 -2.123075 -2.191673
F  -5.607935 -0.841919 -1.816169
O  3.675451 0.282124 1.081574
O  2.0314 0.878474 -2.054585
N  1.196094 1.647922 1.462944
N  2.611931 -1.292424 -0.121149
N  -0.028609 1.934405 1.874759
N  -2.91578 -0.042674 1.336798
N  2.417292 3.321958 0.390372
N  -2.980864 0.191907 0.055817
N  -3.658528 -1.03816 1.72915
N  -0.196359 1.158495 -1.728435
N  -4.251132 -1.494422 0.679457
N  -2.205737 -4.217069 -3.832396
C  1.333745 0.340184 1.127914
C  -0.694376 0.797916 1.829064
C  1.563631 -1.840238 -0.875818
C  0.115539 -0.24873 1.366119
C  -2.118232 0.747403 2.259004
C  2.632375 -0.20257 0.683278
C  1.418066 -3.233517 -0.836571
C  0.711488 -1.053261 -1.662096
C  2.186415 2.663677 1.500819
C  0.428893 -3.824546 -1.60599
C  -0.290845 -1.664166 -2.400064
C  -0.421627 -3.048369 -2.385251
C  2.307137 -4.074365 0.026019
C  0.917745 0.426525 -1.822773
C  2.842325 2.929355 2.69619
C  3.784817 3.941501 2.718404
C  -3.825738 -0.731739 -0.328233
C  3.324751 4.289097 0.404476
C  4.030355 4.63463 1.545348
C  -1.414237 -3.682698 -3.188548
C  -4.280711 -0.922702 -1.73435
C  -0.260504 2.586743 -1.923947
H  -0.157301 -1.283027 1.234242
H  -2.539294 1.7508 2.31554
H  -2.230088 0.274199 3.233698
H  3.519651 -1.727802 -0.242031
H  0.312748 -4.900521 -1.591472
H  -0.94181 -1.072663 -3.030285
H  3.345851 -4.048919 -0.311767
H  2.296651 -3.733177 1.062404
H  1.987404 -5.114584 0.010945
H  4.318897 4.178864 3.628449
H  -1.049234 0.704241 -1.436562
H  3.494108 4.808146 -0.530479
H  4.760874 5.431017 1.518907
H  -0.680196 3.071712 -1.043315
H  -0.888946 2.827366 -2.782204
H  0.731699 2.989496 -2.09985
elementType: Cl F O N C H
totalener: -2305.86566124 hartree
nucrepener: 4672.21506033 hartree
electener: -6978.08072157 hartree
twoeener: 5478.40838152 hartree
cpcmener: -0.06438752 hartree
kineticenergy: 2298.17754477 hartree
xcener: -190.405335495413 hartree
chargesum: -0.0000000
charge: -0.053559 -0.164888 -0.159625 -0.162002 -0.447083 -0.481021 0.233650 -0.121781 -0.275172 0.266874 -0.327645 -0.301294 -0.123233 -0.181993 -0.208649 -0.103052 -0.129176 -0.032914 0.026300 -0.027197 -0.010449 0.285283 -0.021755 0.056051 0.167560 -0.135460 -0.244210 0.238519 -0.247580 0.308078 0.019101 -0.087655 0.105681 0.003585 -0.101381 -0.150328 0.515014 -0.165495 0.183206 0.136992 0.128966 0.179028 0.138745 0.142206 0.112784 0.114414 0.098106 0.148657 0.210875 0.144673 0.163346 0.107373 0.124420 0.105107
qa: -0.0536 -0.1649 -0.1596 -0.1620 -0.4471 -0.4810 0.2337 -0.1218 -0.2752 0.2669 -0.3276 -0.3013 -0.1232 -0.1820 -0.2086 -0.1031 -0.1292 -0.0329 0.0263 -0.0272 -0.0104 0.2853 -0.0218 0.0561 0.1676 -0.1355 -0.2442 0.2385 -0.2476 0.3081 0.0191 -0.0877 0.1057 0.0036 -0.1014 -0.1503 0.5150 -0.1655 0.1832 0.1370 0.1290 0.1790 0.1387 0.1422 0.1128 0.1144 0.0981 0.1487 0.2109 0.1447 0.1633 0.1074 0.1244 0.1051
va: 1.2647 1.1424 1.1456 1.1496 2.0593 2.0432 3.3040 3.2034 2.8901 3.4058 3.0548 2.8886 2.8378 3.1952 2.9983 3.1265 3.7739 3.9645 3.8160 3.6618 3.8386 4.2697 3.8230 3.4987 3.8861 3.9906 4.0498 3.6593 3.9132 4.1643 4.0545 3.9785 4.0917 4.0316 3.8784 4.0201 4.4930 3.8711 0.9790 1.0040 0.9993 1.0139 1.0119 1.0354 0.9923 0.9980 1.0042 1.0040 0.9923 0.9961 0.9877 0.9977 0.9955 1.0238
dispcorr: -0.038714434 hartree
energy: -2305.904375669233
dipole: 24.75275 -23.36521 1.38754 3.44507 -2.23211 1.21296 0.48386 1.89143 2.37529
magnitude: 3.00642 au
magnitude: 7.64171 debye
