program: Orca
programVersion: 5.0.2
elementType: Cl F F F O O N N N N N N N N N N C C C C C C C C C C C C C C C C C C C C C C H H H H H H H H H H H H H H H H
charge: 0
multiplicity: 1
keywords: wb97x-d3
keywords: def2-TZVPP
keywords: def2/J RIJCOSX
keywords: DEFGRID2
keywords: scfconv7
keywords: smallprint printgap noloewdin
keywords: NOSOSCF
formula: C22H16ClF3N10O2
InChI: InChI=1/C22H16ClF3N10O2/c1-11-6-12(9-27)7-14(19(37)28-2)17(11)30-20(38)16-8-13(10-35-33-21(31-34-35)22(24,25)26)32-36(16)18-15(23)4-3-5-29-18/h3-8,28,30H,10H2,1-2H3
54 atoms
Cl 1.344235 2.265317 3.054773
F  -7.231601 1.915176 -1.93452
F  -6.188083 0.029954 -2.047866
F  -7.754443 0.299761 -0.604495
O  0.814854 -2.302767 1.027422
O  3.479471 -0.395738 1.100852
N  -0.144647 1.086673 0.731021
N  1.32939 -1.05263 -0.789746
N  -1.181084 1.735403 1.241345
N  -4.350907 1.529635 1.226577
N  1.340509 1.88289 -0.874658
N  -4.969218 0.651977 0.489641
N  -4.702657 2.762282 0.992671
N  3.96375 -2.460636 1.864458
N  -5.599686 2.720356 0.066913
N  6.35213 -4.793289 -3.283893
C  -0.31019 -0.264774 0.780401
C  -2.044028 0.806453 1.600162
C  2.37635 -1.845652 -1.277058
C  -1.543515 -0.478051 1.34202
C  -3.34387 1.185584 2.220259
C  0.669985 -1.293995 0.362827
C  2.304533 -2.277145 -2.606028
C  3.464023 -2.182505 -0.465019
C  1.018235 1.825092 0.399094
C  3.343915 -3.042441 -3.111904
C  4.482037 -2.966876 -0.982482
C  4.423368 -3.390579 -2.306111
C  1.126917 -1.922917 -3.460063
C  3.619244 -1.596496 0.907355
C  1.764796 2.434641 1.39974
C  2.887665 3.157176 1.031227
C  -5.747783 1.42726 -0.225427
C  2.424741 2.557533 -1.229047
C  3.221062 3.221054 -0.309657
C  5.488466 -4.169913 -2.845429
C  -6.737204 0.912861 -1.215882
C  4.175693 -2.047618 3.231724
H  -2.018211 -1.426994 1.531443
H  -3.231399 2.063153 2.853248
H  -3.741311 0.372182 2.823607
H  1.045129 -0.261065 -1.355609
H  3.30778 -3.381158 -4.13925
H  5.340828 -3.222557 -0.375436
H  1.059363 -0.845942 -3.630808
H  1.195789 -2.403306 -4.434223
H  0.190129 -2.234848 -2.995489
H  3.495258 3.647906 1.779461
H  3.956165 -3.446978 1.658484
H  2.663437 2.572496 -2.284713
H  4.093581 3.769842 -0.635087
H  3.25602 -1.685189 3.695299
H  4.927323 -1.260724 3.294629
H  4.531602 -2.904071 3.798654
elementType: Cl F O N C H
totalener: -2305.87045574 hartree
nucrepener: 4345.85221417 hartree
electener: -6651.72266990 hartree
twoeener: 5153.27694400 hartree
cpcmener: -0.05943651 hartree
kineticenergy: 2298.16995896 hartree
xcener: -190.397118888193 hartree
chargesum: 0.0000000
charge: -0.046223 -0.158483 -0.163141 -0.165907 -0.459130 -0.513488 0.155045 -0.153461 -0.313576 0.258807 -0.363758 -0.280799 -0.121719 -0.164372 -0.211141 -0.108383 0.066353 -0.004675 0.207494 -0.158979 -0.009221 0.265606 -0.084841 -0.050197 0.199127 -0.113719 -0.167616 0.199049 -0.256323 0.324654 0.024048 -0.091220 0.090879 0.009669 -0.090256 -0.139476 0.498128 -0.167167 0.180974 0.132312 0.148846 0.208839 0.139000 0.143078 0.108657 0.101451 0.117242 0.148905 0.185863 0.148933 0.164613 0.107636 0.107252 0.114809
qa: -0.0462 -0.1585 -0.1631 -0.1659 -0.4591 -0.5135 0.1550 -0.1535 -0.3136 0.2588 -0.3638 -0.2808 -0.1217 -0.1644 -0.2111 -0.1084 0.0664 -0.0047 0.2075 -0.1590 -0.0092 0.2656 -0.0848 -0.0502 0.1991 -0.1137 -0.1676 0.1990 -0.2563 0.3247 0.0240 -0.0912 0.0909 0.0097 -0.0903 -0.1395 0.4981 -0.1672 0.1810 0.1323 0.1488 0.2088 0.1390 0.1431 0.1087 0.1015 0.1172 0.1489 0.1859 0.1489 0.1646 0.1076 0.1073 0.1148
va: 1.2685 1.1516 1.1436 1.1366 2.0548 2.0082 3.3453 3.1988 2.8762 3.4432 3.0397 2.9504 2.8532 3.2153 2.9799 3.1291 3.7538 3.9466 3.7102 3.9151 3.8352 4.2144 3.9079 3.8289 3.8941 3.9541 4.0410 3.6892 3.9157 4.1325 4.0016 3.9778 4.1255 4.0055 3.8783 4.0185 4.5289 3.9122 0.9941 1.0145 0.9948 1.0045 1.0123 1.0267 0.9964 1.0051 0.9964 1.0044 0.9998 0.9970 0.9865 0.9921 0.9951 0.9989
dispcorr: -0.031560647 hartree
energy: -2305.902016385487
dipole: 46.89320 -45.19379 1.69941 -15.25664 15.43483 0.17820 1.69816 -0.81601 0.88215
magnitude: 1.92300 au
magnitude: 4.88788 debye
