program: Orca
programVersion: 5.0.2
elementType: Cl F F F O O N N N N N N N N N N C C C C C C C C C C C C C C C C C C C C C C H H H H H H H H H H H H H H H H
charge: 0
multiplicity: 1
keywords: wb97x-d3
keywords: def2-TZVPP
keywords: def2/J RIJCOSX
keywords: DEFGRID2
keywords: scfconv7
keywords: smallprint printgap noloewdin
keywords: NOSOSCF
formula: C22H16ClF3N10O2
InChI: InChI=1/C22H16ClF3N10O2/c1-11-6-12(9-27)7-14(19(37)28-2)17(11)30-20(38)16-8-13(10-35-33-21(31-34-35)22(24,25)26)32-36(16)18-15(23)4-3-5-29-18/h3-8,28,30H,10H2,1-2H3
54 atoms
Cl 2.462336 1.898429 4.022051
F  -5.641453 -1.035085 -1.419954
F  -4.688567 0.8751 -1.668978
F  -3.633594 -0.924551 -2.204675
O  3.712811 1.007688 0.634913
O  1.53147 1.126886 -2.344671
N  1.013602 1.209958 1.521654
N  3.146439 -0.731639 -0.674908
N  -0.13073 0.946871 2.125254
N  -2.708738 -0.713936 1.650718
N  1.314436 3.290482 0.517765
N  -2.698468 -0.798824 0.350465
N  -3.865414 -0.383866 2.146936
N  -0.527486 0.605193 -1.545937
N  -4.669029 -0.23416 1.148417
N  -1.111401 -5.10917 -3.536173
C  1.57235 0.108796 0.959178
C  -0.326195 -0.349245 1.964387
C  2.255864 -1.606659 -1.316212
C  0.719157 -0.933169 1.239815
C  -1.550591 -1.012004 2.487674
C  2.88702 0.183148 0.288101
C  2.611539 -2.959369 -1.37369
C  1.054487 -1.151739 -1.871301
C  1.524876 2.533156 1.567591
C  1.737196 -3.850907 -1.975497
C  0.182166 -2.063617 -2.443773
C  0.524567 -3.410677 -2.495497
C  3.894853 -3.439377 -0.770619
C  0.715418 0.311949 -1.936165
C  2.194936 2.966295 2.703875
C  2.656847 4.270129 2.735462
C  -3.939585 -0.49166 0.06362
C  1.760515 4.539098 0.540803
C  2.431979 5.071946 1.628971
C  -0.375855 -4.350731 -3.077822
C  -4.478458 -0.39623 -1.32345
C  -1.126002 1.916805 -1.607992
H  0.823212 -1.972118 0.974767
H  -1.804254 -0.668439 3.48839
H  -1.422482 -2.093341 2.514707
H  4.111029 -0.752332 -0.986859
H  1.992016 -4.901819 -2.020464
H  -0.75283 -1.731155 -2.875095
H  3.973708 -4.522777 -0.837625
H  4.764399 -3.016081 -1.27823
H  3.969663 -3.16052 0.281775
H  3.185669 4.649216 3.599476
H  -1.082752 -0.130606 -1.134318
H  1.571491 5.137666 -0.341356
H  2.777117 6.096199 1.612466
H  -1.60881 2.151577 -0.660898
H  -1.872653 1.967522 -2.401809
H  -0.370281 2.671641 -1.799418
elementType: Cl F O N C H
totalener: -2305.86583962 hartree
nucrepener: 4647.92884362 hartree
electener: -6953.79468324 hartree
twoeener: 5453.94072099 hartree
cpcmener: -0.06385059 hartree
kineticenergy: 2298.18615043 hartree
xcener: -190.406987654345 hartree
chargesum: -0.0000000
charge: -0.052641 -0.159824 -0.165961 -0.162868 -0.448360 -0.485104 0.231267 -0.125343 -0.269751 0.286275 -0.331573 -0.313100 -0.126282 -0.185805 -0.203976 -0.105414 -0.139666 -0.085420 0.027578 0.021197 -0.030239 0.289016 -0.028077 0.035195 0.180007 -0.135168 -0.193089 0.215378 -0.242365 0.308103 0.014069 -0.084974 0.105131 0.008191 -0.103300 -0.140304 0.516417 -0.176073 0.185491 0.131754 0.139355 0.180255 0.139632 0.140371 0.098191 0.113562 0.113592 0.147500 0.212861 0.144342 0.163267 0.112142 0.124564 0.109973
qa: -0.0526 -0.1598 -0.1660 -0.1629 -0.4484 -0.4851 0.2313 -0.1253 -0.2698 0.2863 -0.3316 -0.3131 -0.1263 -0.1858 -0.2040 -0.1054 -0.1397 -0.0854 0.0276 0.0212 -0.0302 0.2890 -0.0281 0.0352 0.1800 -0.1352 -0.1931 0.2154 -0.2424 0.3081 0.0141 -0.0850 0.1051 0.0082 -0.1033 -0.1403 0.5164 -0.1761 0.1855 0.1318 0.1394 0.1803 0.1396 0.1404 0.0982 0.1136 0.1136 0.1475 0.2129 0.1443 0.1633 0.1121 0.1246 0.1100
va: 1.2652 1.1527 1.1373 1.1426 2.0596 2.0399 3.3173 3.2110 2.8672 3.4118 3.0580 2.8949 2.8412 3.1786 2.9882 3.1296 3.7808 3.9854 3.7975 3.6581 3.8956 4.2729 3.8415 3.5396 3.8604 3.9816 4.0682 3.6793 3.9149 4.1738 4.0632 3.9780 4.0949 4.0264 3.8816 4.0252 4.4885 3.8659 0.9743 1.0057 0.9922 1.0129 1.0118 1.0291 1.0045 0.9926 0.9974 1.0043 0.9906 0.9957 0.9880 0.9967 0.9980 1.0246
dispcorr: -0.038304221 hartree
energy: -2305.904143839893
dipole: 27.09699 -24.85710 2.23989 -1.86676 1.56276 -0.30400 -2.57977 4.65155 2.07178
magnitude: 3.06624 au
magnitude: 7.79375 debye
