program: Orca
programVersion: 5.0.2
elementType: Cl F F F O O N N N N N N N N N N C C C C C C C C C C C C C C C C C C C C C C H H H H H H H H H H H H H H H H
charge: 0
multiplicity: 1
keywords: wb97x-d3
keywords: def2-TZVPP
keywords: def2/J RIJCOSX
keywords: DEFGRID2
keywords: scfconv7
keywords: smallprint printgap noloewdin
keywords: NOSOSCF
formula: C22H16ClF3N10O2
InChI: InChI=1/C22H16ClF3N10O2/c1-11-6-12(9-27)7-14(19(37)28-2)17(11)30-20(38)16-8-13(10-35-33-21(31-34-35)22(24,25)26)32-36(16)18-15(23)4-3-5-29-18/h3-8,28,30H,10H2,1-2H3
54 atoms
Cl 1.140659 -3.159424 -0.020897
F  -5.119026 2.952939 3.168641
F  -5.896651 3.376208 1.205407
F  -7.007322 2.126104 2.570334
O  0.901735 3.25929 -0.344942
O  1.197284 1.152064 -3.41214
N  0.342874 -0.1833 0.30743
N  2.515241 1.786809 -0.84053
N  -0.80466 -0.852799 0.298358
N  -3.968486 -0.01037 0.471268
N  1.994822 0.237061 1.850451
N  -4.323512 1.24052 0.538594
N  -4.476203 -0.757702 1.409834
N  0.306314 -0.870325 -2.975119
N  -5.206727 0.014005 2.140097
N  5.312438 -4.216205 -2.089489
C  0.225631 1.037928 -0.29228
C  -1.665938 -0.081381 -0.328343
C  3.081595 0.551892 -1.16836
C  -1.074634 1.132454 -0.712335
C  -3.068535 -0.532077 -0.548146
C  1.245301 2.100986 -0.485045
C  4.321056 0.242205 -0.5873
C  2.462106 -0.337822 -2.056768
C  1.423753 -0.661199 1.076517
C  4.885523 -0.994479 -0.847728
C  3.045486 -1.57311 -2.295569
C  4.24702 -1.905639 -1.683003
C  5.038504 1.226228 0.283259
C  1.259791 0.059603 -2.865233
C  1.854574 -1.985596 1.013511
C  2.924252 -2.358432 1.81049
C  -5.100624 1.226038 1.593578
C  3.022523 -0.120549 2.605811
C  3.520415 -1.411601 2.624259
C  4.833514 -3.1837 -1.913124
C  -5.787136 2.433379 2.136871
C  -0.883596 -0.665099 -3.765278
H  -1.524599 1.947576 -1.254859
H  -3.142208 -1.616165 -0.501513
H  -3.441559 -0.198436 -1.514873
H  3.144957 2.580722 -0.827129
H  5.828916 -1.257814 -0.386816
H  2.589007 -2.27027 -2.985767
H  5.848305 0.743522 0.826997
H  5.480419 2.02642 -0.316608
H  4.379902 1.699291 1.010302
H  3.291506 -3.375631 1.784842
H  0.375722 -1.718043 -2.435877
H  3.459308 0.652712 3.225097
H  4.356768 -1.672843 3.256862
H  -0.6528 -0.599287 -4.829505
H  -1.410885 0.243631 -3.473437
H  -1.54671 -1.511974 -3.61301
elementType: Cl F O N C H
totalener: -2305.86143295 hartree
nucrepener: 4607.45348850 hartree
electener: -6913.31492146 hartree
twoeener: 5412.00971943 hartree
cpcmener: -0.06731073 hartree
kineticenergy: 2298.17882159 hartree
xcener: -190.412775536786 hartree
chargesum: -0.0000000
charge: -0.055495 -0.165252 -0.161106 -0.161848 -0.442922 -0.479166 0.237158 -0.110182 -0.315279 0.262288 -0.350025 -0.276607 -0.121841 -0.169294 -0.219413 -0.098158 0.029594 -0.035987 0.139276 -0.129240 -0.021962 0.267923 -0.034447 0.004363 0.204248 -0.171428 -0.288643 0.252149 -0.260821 0.305171 0.040468 -0.091871 0.098132 -0.013728 -0.101503 -0.147602 0.497420 -0.192738 0.181360 0.130379 0.146260 0.180285 0.135431 0.143698 0.104871 0.130682 0.110560 0.146817 0.196121 0.151696 0.161961 0.128171 0.110818 0.119256
qa: -0.0555 -0.1653 -0.1611 -0.1618 -0.4429 -0.4792 0.2372 -0.1102 -0.3153 0.2623 -0.3500 -0.2766 -0.1218 -0.1693 -0.2194 -0.0982 0.0296 -0.0360 0.1393 -0.1292 -0.0220 0.2679 -0.0344 0.0044 0.2042 -0.1714 -0.2886 0.2521 -0.2608 0.3052 0.0405 -0.0919 0.0981 -0.0137 -0.1015 -0.1476 0.4974 -0.1927 0.1814 0.1304 0.1463 0.1803 0.1354 0.1437 0.1049 0.1307 0.1106 0.1468 0.1961 0.1517 0.1620 0.1282 0.1108 0.1193
va: 1.2568 1.1375 1.1482 1.1455 2.0745 2.0475 3.2672 3.1855 2.8674 3.4425 3.0439 2.9376 2.8439 3.1740 2.9923 3.1352 3.7040 3.9791 3.6960 3.8440 3.8348 4.3226 3.7714 3.5736 3.8752 3.9516 4.0211 3.6179 3.9071 4.1700 3.9182 3.9377 4.1106 4.0038 3.8366 4.0304 4.5302 3.9011 1.0007 1.0148 0.9974 1.0142 1.0133 1.0286 1.0009 0.9915 0.9976 1.0054 1.0086 0.9942 0.9889 0.9960 0.9930 0.9943
dispcorr: -0.041256039 hartree
energy: -2305.902688993028
dipole: 40.50653 -37.91821 2.58831 -7.49801 5.77109 -1.72692 -17.69823 17.60021 -0.09802
magnitude: 3.11307 au
magnitude: 7.91280 debye
