program: Orca
programVersion: 5.0.2
elementType: Cl F F F O O N N N N N N N N N N C C C C C C C C C C C C C C C C C C C C C C H H H H H H H H H H H H H H H H
charge: 0
multiplicity: 1
keywords: wb97x-d3
keywords: def2-TZVPP
keywords: def2/J RIJCOSX
keywords: DEFGRID2
keywords: scfconv7
keywords: smallprint printgap noloewdin
keywords: NOSOSCF
formula: C22H16ClF3N10O2
InChI: InChI=1/C22H16ClF3N10O2/c1-11-6-12(9-27)7-14(19(37)28-2)17(11)30-20(38)16-8-13(10-35-33-21(31-34-35)22(24,25)26)32-36(16)18-15(23)4-3-5-29-18/h3-8,28,30H,10H2,1-2H3
54 atoms
Cl 0.733052 -2.866368 -0.530823
F  -6.21647 1.436353 3.580272
F  -6.508784 -0.559302 2.823762
F  -4.679404 -0.058701 3.830205
O  1.35253 3.516676 0.09203
O  1.660752 1.850357 -3.233087
N  0.29136 0.129435 0.141044
N  2.800535 1.913007 -0.499228
N  -0.919327 -0.368511 -0.085989
N  -3.944973 0.780374 -0.019931
N  1.800453 0.108854 1.873166
N  -4.146708 0.067391 1.049087
N  -4.614044 1.897581 -0.047347
N  0.48198 -0.070155 -3.182273
N  -5.305161 1.939769 1.041819
N  4.911939 -4.165527 -2.509695
C  0.391622 1.430918 -0.259786
C  -1.603448 0.599155 -0.655755
C  3.229235 0.669329 -0.971139
C  -0.831621 1.765628 -0.776689
C  -3.017663 0.387338 -1.071253
C  1.554081 2.352743 -0.197444
C  4.354311 0.101535 -0.353385
C  2.588284 0.01726 -2.033698
C  1.208081 -0.593271 0.930776
C  4.778367 -1.150083 -0.766591
C  3.028161 -1.23843 -2.42291
C  4.113121 -1.825581 -1.784661
C  5.10751 0.834243 0.713478
C  1.530329 0.692866 -2.859307
C  1.469454 -1.946728 0.72186
C  2.386931 -2.564953 1.554972
C  -5.00509 0.817455 1.695377
C  2.685192 -0.482718 2.661417
C  3.006838 -1.823662 2.545086
C  4.55453 -3.118104 -2.190552
C  -5.607165 0.409815 2.997049
C  -0.593332 0.402544 -4.020207
H  -1.116459 2.706667 -1.21789
H  -3.207788 -0.659306 -1.300276
H  -3.265701 0.985984 -1.944553
H  3.523964 2.598483 -0.315104
H  5.632723 -1.608775 -0.285804
H  2.557014 -1.751878 -3.250578
H  5.786866 0.164523 1.237065
H  5.711436 1.636424 0.281166
H  4.451388 1.292947 1.451883
H  2.619692 -3.612861 1.422171
H  0.403519 -0.99317 -2.787453
H  3.146219 0.13652 3.420591
H  3.726049 -2.279926 3.210284
H  -1.407314 -0.314728 -3.97187
H  -0.282221 0.497136 -5.06126
H  -0.965619 1.369775 -3.685156
elementType: Cl F O N C H
totalener: -2305.86147097 hartree
nucrepener: 4620.84086164 hartree
electener: -6926.70233261 hartree
twoeener: 5425.41157400 hartree
cpcmener: -0.06797054 hartree
kineticenergy: 2298.19352375 hartree
xcener: -190.415398834554 hartree
chargesum: -0.0000000
charge: -0.055393 -0.159195 -0.165913 -0.162979 -0.443453 -0.479381 0.235028 -0.110927 -0.311277 0.256946 -0.350914 -0.275449 -0.120811 -0.168202 -0.213716 -0.098807 0.030092 -0.032223 0.131316 -0.129648 -0.022646 0.270718 -0.026973 0.007735 0.211935 -0.175438 -0.288146 0.253432 -0.262382 0.308864 0.028463 -0.088057 0.088947 -0.014019 -0.102990 -0.146916 0.498393 -0.193083 0.180309 0.144313 0.134136 0.180297 0.134954 0.142231 0.105217 0.130445 0.110744 0.145876 0.194439 0.152250 0.162402 0.118856 0.129674 0.110925
qa: -0.0554 -0.1592 -0.1659 -0.1630 -0.4435 -0.4794 0.2350 -0.1109 -0.3113 0.2569 -0.3509 -0.2754 -0.1208 -0.1682 -0.2137 -0.0988 0.0301 -0.0322 0.1313 -0.1296 -0.0226 0.2707 -0.0270 0.0077 0.2119 -0.1754 -0.2881 0.2534 -0.2624 0.3089 0.0285 -0.0881 0.0889 -0.0140 -0.1030 -0.1469 0.4984 -0.1931 0.1803 0.1443 0.1341 0.1803 0.1350 0.1422 0.1052 0.1304 0.1107 0.1459 0.1944 0.1523 0.1624 0.1189 0.1297 0.1109
va: 1.2555 1.1520 1.1362 1.1437 2.0738 2.0481 3.2760 3.1847 2.8599 3.4539 3.0437 2.9615 2.8467 3.1740 2.9874 3.1353 3.6798 3.9666 3.7079 3.8347 3.8504 4.3240 3.7640 3.5622 3.8643 3.9526 4.0192 3.6113 3.9065 4.1699 3.9236 3.9379 4.1310 4.0052 3.8415 4.0309 4.5283 3.8990 0.9991 1.0065 1.0066 1.0141 1.0132 1.0290 1.0011 0.9914 0.9977 1.0057 1.0086 0.9942 0.9889 0.9939 0.9956 0.9961
dispcorr: -0.041236084 hartree
energy: -2305.902707051835
dipole: 40.71875 -38.39205 2.32670 3.74034 -5.88601 -2.14567 -20.88465 20.85972 -0.02493
magnitude: 3.16513 au
magnitude: 8.04512 debye
