program: Orca
programVersion: 5.0.2
elementType: Cl F F F O O N N N N N N N N N N C C C C C C C C C C C C C C C C C C C C C C H H H H H H H H H H H H H H H H
charge: 0
multiplicity: 1
keywords: wb97x-d3
keywords: def2-TZVPP
keywords: def2/J RIJCOSX
keywords: DEFGRID2
keywords: scfconv7
keywords: smallprint printgap noloewdin
keywords: NOSOSCF
formula: C22H16ClF3N10O2
InChI: InChI=1/C22H16ClF3N10O2/c1-11-6-12(9-27)7-14(19(37)28-2)17(11)30-20(38)16-8-13(10-35-33-21(31-34-35)22(24,25)26)32-36(16)18-15(23)4-3-5-29-18/h3-8,28,30H,10H2,1-2H3
54 atoms
Cl 2.517014 1.452731 4.362146
F  -5.261581 -1.9364 -2.035307
F  -3.914647 -3.346109 -1.128454
F  -5.591221 -2.606121 -0.005977
O  3.739516 0.062466 1.086473
O  2.319948 1.343485 -2.050286
N  1.304644 1.506047 1.644474
N  2.60105 -1.141578 -0.441569
N  0.067702 1.799521 2.016503
N  -2.77789 0.098681 0.813054
N  2.642062 3.239692 0.851474
N  -3.524927 -0.964845 0.871683
N  -2.625945 0.567738 -0.394308
N  0.150463 1.855355 -1.617244
N  -3.297177 -0.202229 -1.180389
N  -2.776909 -2.725582 -4.200117
C  1.399064 0.268653 1.097328
C  -0.647688 0.728825 1.735891
C  1.497988 -1.44213 -1.26046
C  0.140956 -0.27707 1.163039
C  -2.118206 0.689973 1.97126
C  2.679431 -0.256795 0.580569
C  1.157627 -2.791769 -1.410939
C  0.756809 -0.438145 -1.896076
C  2.336994 2.455462 1.857596
C  0.058145 -3.12016 -2.190139
C  -0.347896 -0.787673 -2.655039
C  -0.697855 -2.125366 -2.799486
C  1.938317 -3.860497 -0.711259
C  1.160155 1.009297 -1.848155
C  2.959123 2.526637 3.097216
C  3.950903 3.474809 3.280298
C  -3.837055 -1.130462 -0.391632
C  3.59181 4.148681 1.020871
C  4.272904 4.301507 2.217466
C  -1.849464 -2.467543 -3.567682
C  -4.662375 -2.265001 -0.89566
C  0.256324 3.293826 -1.649043
H  -0.176453 -1.255478 0.841245
H  -2.518546 1.689346 2.137157
H  -2.383643 0.066316 2.823038
H  3.47252 -1.609103 -0.665072
H  -0.224309 -4.158673 -2.305549
H  -0.928448 -0.027614 -3.160346
H  2.972062 -3.904853 -1.060655
H  1.969949 -3.688984 0.366095
H  1.493878 -4.839293 -0.881929
H  4.464229 3.562412 4.228207
H  -0.747824 1.476017 -1.350762
H  3.817779 4.777805 0.169077
H  5.042249 5.054096 2.318951
H  1.252769 3.59253 -1.958635
H  0.054709 3.721554 -0.667713
H  -0.463369 3.703404 -2.358368
elementType: Cl F O N C H
totalener: -2305.86433359 hartree
nucrepener: 4680.80254783 hartree
electener: -6986.66688142 hartree
twoeener: 5487.81273661 hartree
cpcmener: -0.06290617 hartree
kineticenergy: 2298.17882267 hartree
xcener: -190.407776990700 hartree
chargesum: -0.0000000
charge: -0.052079 -0.160945 -0.165895 -0.160762 -0.448231 -0.486807 0.225784 -0.123759 -0.271295 0.266013 -0.326981 -0.273081 -0.133581 -0.201246 -0.209753 -0.097842 -0.134851 -0.058834 0.021270 -0.012384 0.001470 0.283351 -0.030240 0.094783 0.166063 -0.131416 -0.265223 0.240347 -0.242436 0.297045 0.017000 -0.084434 0.095690 0.007809 -0.102283 -0.157940 0.514857 -0.153889 0.185057 0.137324 0.133907 0.179921 0.139690 0.147988 0.113181 0.112375 0.098392 0.146503 0.224569 0.144338 0.163470 0.103056 0.100925 0.124006
qa: -0.0521 -0.1609 -0.1659 -0.1608 -0.4482 -0.4868 0.2258 -0.1238 -0.2713 0.2660 -0.3270 -0.2731 -0.1336 -0.2012 -0.2098 -0.0978 -0.1349 -0.0588 0.0213 -0.0124 0.0015 0.2834 -0.0302 0.0948 0.1661 -0.1314 -0.2652 0.2403 -0.2424 0.2970 0.0170 -0.0844 0.0957 0.0078 -0.1023 -0.1579 0.5149 -0.1539 0.1851 0.1373 0.1339 0.1799 0.1397 0.1480 0.1132 0.1124 0.0984 0.1465 0.2246 0.1443 0.1635 0.1031 0.1009 0.1240
va: 1.2661 1.1498 1.1316 1.1508 2.0596 2.0360 3.3122 3.2090 2.8989 3.4187 3.0527 2.9333 2.8282 3.1903 2.9437 3.1212 3.7722 3.9923 3.8030 3.6420 3.8256 4.2785 3.8302 3.4758 3.8681 3.9826 4.0381 3.6158 3.9168 4.1790 4.0631 3.9747 4.0944 4.0284 3.8802 4.0015 4.4922 3.8698 0.9757 1.0051 0.9995 1.0124 1.0110 1.0356 0.9929 0.9975 1.0046 1.0048 0.9937 0.9955 0.9877 1.0221 1.0010 0.9958
dispcorr: -0.040166186 hartree
energy: -2305.904499771924
dipole: 26.88047 -25.86647 1.01399 12.81390 -12.23556 0.57833 -4.68380 7.42421 2.74040
magnitude: 2.97867 au
magnitude: 7.57118 debye
