program: Orca
programVersion: 5.0.2
elementType: Cl F F F O O N N N N N N N N N N C C C C C C C C C C C C C C C C C C C C C C H H H H H H H H H H H H H H H H
charge: 0
multiplicity: 1
keywords: wb97x-d3
keywords: def2-TZVPP
keywords: def2/J RIJCOSX
keywords: DEFGRID2
keywords: scfconv7
keywords: smallprint printgap noloewdin
keywords: NOSOSCF
formula: C22H16ClF3N10O2
InChI: InChI=1/C22H16ClF3N10O2/c1-11-6-12(9-27)7-14(19(37)28-2)17(11)30-20(38)16-8-13(10-35-33-21(31-34-35)22(24,25)26)32-36(16)18-15(23)4-3-5-29-18/h3-8,28,30H,10H2,1-2H3
54 atoms
Cl -0.305283 -1.780405 0.381535
F  -3.763263 -2.422174 2.322431
F  -5.377071 -1.15289 2.953458
F  -5.545215 -2.300025 1.128599
O  2.774343 3.879859 -0.014245
O  1.383297 2.331027 -3.129356
N  0.66669 1.143059 0.772696
N  3.224976 1.863748 -0.888638
N  -0.638886 1.128561 1.013821
N  -3.290739 1.299558 0.591282
N  2.580932 0.509545 1.874029
N  -3.721925 0.663569 1.642184
N  -3.406933 0.62574 -0.518535
N  -0.419247 1.128199 -2.52248
N  -3.950776 -0.500567 -0.212687
N  1.830076 -4.513908 -2.545461
C  1.064289 2.317299 0.203968
C  -1.100526 2.277183 0.5794
C  2.948494 0.56445 -1.326605
C  -0.067767 3.080561 0.070237
C  -2.567209 2.556317 0.64788
C  2.42237 2.736009 -0.230714
C  3.893462 -0.431757 -1.041325
C  1.777265 0.262817 -2.03576
C  1.472326 0.110056 1.287932
C  3.598988 -1.741013 -1.384646
C  1.500373 -1.056408 -2.357142
C  2.400173 -2.058009 -2.014518
C  5.204207 -0.09874 -0.398252
C  0.896971 1.343936 -2.594049
C  1.114898 -1.234829 1.183334
C  1.971575 -2.174188 1.732739
C  -4.135669 -0.459545 1.108082
C  3.402589 -0.393373 2.387783
C  3.136315 -1.750714 2.348081
C  2.088929 -3.415982 -2.313152
C  -4.713403 -1.591485 1.887635
C  -1.372566 2.061231 -3.073568
H  -0.141956 4.057842 -0.377934
H  -2.889984 3.179784 -0.184027
H  -2.850833 3.055445 1.57357
H  4.165887 2.207591 -1.041564
H  4.304573 -2.525995 -1.144945
H  0.602015 -1.311123 -2.903662
H  5.697809 -0.997386 -0.033086
H  5.878925 0.371612 -1.118539
H  5.098766 0.592072 0.436901
H  1.731605 -3.227058 1.669452
H  -0.770541 0.348795 -1.989039
H  4.30261 -0.016277 2.856873
H  3.822285 -2.462368 2.785042
H  -1.198254 3.074543 -2.710369
H  -2.368682 1.753243 -2.772568
H  -1.333229 2.07883 -4.163518
elementType: Cl F O N C H
totalener: -2305.85978617 hartree
nucrepener: 4795.09749179 hartree
electener: -7100.95727796 hartree
twoeener: 5600.28887507 hartree
cpcmener: -0.06315193 hartree
kineticenergy: 2298.19551008 hartree
xcener: -190.419387076891 hartree
chargesum: -0.0000000
charge: -0.060173 -0.165056 -0.161078 -0.160370 -0.445133 -0.484634 0.253526 -0.111787 -0.351268 0.282299 -0.354750 -0.266956 -0.122658 -0.157339 -0.215528 -0.097393 0.033544 0.016447 0.142007 -0.178922 -0.006527 0.266698 -0.030905 0.013480 0.194775 -0.163913 -0.266857 0.222724 -0.262432 0.305114 0.055088 -0.097967 0.073116 -0.013482 -0.106146 -0.144745 0.495485 -0.195856 0.177350 0.144597 0.145082 0.180249 0.135048 0.138789 0.105274 0.131465 0.109412 0.146266 0.185340 0.151043 0.161790 0.109156 0.118570 0.128142
qa: -0.0602 -0.1651 -0.1611 -0.1604 -0.4451 -0.4846 0.2535 -0.1118 -0.3513 0.2823 -0.3547 -0.2670 -0.1227 -0.1573 -0.2155 -0.0974 0.0335 0.0164 0.1420 -0.1789 -0.0065 0.2667 -0.0309 0.0135 0.1948 -0.1639 -0.2669 0.2227 -0.2624 0.3051 0.0551 -0.0980 0.0731 -0.0135 -0.1061 -0.1447 0.4955 -0.1959 0.1773 0.1446 0.1451 0.1802 0.1350 0.1388 0.1053 0.1315 0.1094 0.1463 0.1853 0.1510 0.1618 0.1092 0.1186 0.1281
va: 1.2523 1.1352 1.1481 1.1484 2.0732 2.0428 3.2488 3.1823 2.8382 3.4220 3.0416 2.9365 2.8570 3.1786 2.9668 3.1333 3.6823 3.9320 3.6808 3.8586 3.8206 4.3291 3.7746 3.5792 3.9007 3.9341 4.0127 3.6449 3.9087 4.1746 3.8940 3.9408 4.1176 4.0045 3.8376 4.0237 4.5297 3.8916 0.9982 0.9957 0.9983 1.0138 1.0128 1.0309 1.0008 0.9916 0.9974 1.0065 1.0087 0.9942 0.9893 0.9932 1.0080 0.9971
dispcorr: -0.043918035 hartree
energy: -2305.903704206961
dipole: 36.58989 -35.05678 1.53311 17.64192 -17.34705 0.29487 -15.06165 16.37221 1.31056
magnitude: 2.03837 au
magnitude: 5.18112 debye
