program: Orca
programVersion: 5.0.2
elementType: Cl F F F O O N N N N N N N N N N C C C C C C C C C C C C C C C C C C C C C C H H H H H H H H H H H H H H H H
charge: 0
multiplicity: 1
keywords: wb97x-d3
keywords: def2-TZVPP
keywords: def2/J RIJCOSX
keywords: DEFGRID2
keywords: scfconv7
keywords: smallprint printgap noloewdin
keywords: NOSOSCF
formula: C22H16ClF3N10O2
InChI: InChI=1/C22H16ClF3N10O2/c1-11-6-12(9-27)7-14(19(37)28-2)17(11)30-20(38)16-8-13(10-35-33-21(31-34-35)22(24,25)26)32-36(16)18-15(23)4-3-5-29-18/h3-8,28,30H,10H2,1-2H3
54 atoms
Cl -0.31942 -1.821929 0.171059
F  -4.520152 -1.278194 3.273002
F  -6.283107 -1.166513 2.046097
F  -4.75582 -2.606596 1.58477
O  2.737839 3.860004 0.089183
O  1.454232 2.269687 -3.084279
N  0.617223 1.086065 0.706071
N  3.272975 1.868873 -0.787817
N  -0.701682 1.065764 0.874338
N  -3.357539 1.294842 0.487775
N  2.472963 0.423626 1.889492
N  -3.793316 0.759702 1.590806
N  -3.535066 0.550899 -0.567854
N  -0.28141 0.94782 -2.528258
N  -4.13102 -0.519284 -0.169289
N  2.300871 -4.551009 -2.58273
C  1.042818 2.27406 0.188288
C  -1.137894 2.225134 0.443569
C  3.071466 0.56347 -1.245339
C  -0.080098 3.040384 0.011798
C  -2.599773 2.528625 0.44373
C  2.417144 2.714229 -0.162559
C  4.052335 -0.387414 -0.925067
C  1.949513 0.210456 -2.008069
C  1.398809 0.040543 1.232639
C  3.845919 -1.704108 -1.300044
C  1.761866 -1.116486 -2.362923
C  2.698437 -2.07392 -1.994477
C  5.306311 0.002784 -0.2053
C  1.020469 1.245322 -2.574755
C  1.058776 -1.301738 1.060014
C  1.894221 -2.257348 1.613444
C  -4.278681 -0.373567 1.148433
C  3.274518 -0.49405 2.409447
C  3.023029 -1.850434 2.302868
C  2.479556 -3.442408 -2.326153
C  -4.963284 -1.367315 2.022209
C  -1.283869 1.818444 -3.093497
H  -0.13124 4.02923 -0.413419
H  -2.88755 3.075355 -0.452805
H  -2.893278 3.123559 1.307764
H  4.212474 2.23842 -0.87531
H  4.57965 -2.454472 -1.03555
H  0.906021 -1.409592 -2.956426
H  5.116266 0.659263 0.643079
H  5.833447 -0.876059 0.161285
H  5.988987 0.534349 -0.873924
H  1.66751 -3.308436 1.494818
H  -0.592896 0.137188 -2.01727
H  4.146289 -0.129995 2.938351
H  3.693471 -2.574131 2.744184
H  -1.199623 2.834083 -2.705029
H  -2.262949 1.428927 -2.832142
H  -1.210362 1.861218 -4.181068
elementType: Cl F O N C H
totalener: -2305.86055388 hartree
nucrepener: 4770.46526306 hartree
electener: -7076.32581694 hartree
twoeener: 5575.53762355 hartree
cpcmener: -0.06271097 hartree
kineticenergy: 2298.20180548 hartree
xcener: -190.421450463484 hartree
chargesum: -0.0000000
charge: -0.060652 -0.160474 -0.165742 -0.161105 -0.444778 -0.482489 0.243180 -0.112043 -0.354494 0.280553 -0.354376 -0.267939 -0.121047 -0.165348 -0.213718 -0.098128 0.042263 0.017378 0.144597 -0.168813 -0.016816 0.270625 -0.035446 0.004965 0.191856 -0.163152 -0.284612 0.238129 -0.258273 0.304476 0.055756 -0.092440 0.077007 -0.009360 -0.110108 -0.147540 0.493601 -0.200405 0.178316 0.145097 0.147014 0.179905 0.134121 0.144407 0.109298 0.104934 0.130274 0.146972 0.192825 0.150195 0.161731 0.110091 0.119848 0.129881
qa: -0.0607 -0.1605 -0.1657 -0.1611 -0.4448 -0.4825 0.2432 -0.1120 -0.3545 0.2806 -0.3544 -0.2679 -0.1210 -0.1653 -0.2137 -0.0981 0.0423 0.0174 0.1446 -0.1688 -0.0168 0.2706 -0.0354 0.0050 0.1919 -0.1632 -0.2846 0.2381 -0.2583 0.3045 0.0558 -0.0924 0.0770 -0.0094 -0.1101 -0.1475 0.4936 -0.2004 0.1783 0.1451 0.1470 0.1799 0.1341 0.1444 0.1093 0.1049 0.1303 0.1470 0.1928 0.1502 0.1617 0.1101 0.1198 0.1299
va: 1.2530 1.1482 1.1361 1.1479 2.0728 2.0436 3.2509 3.1872 2.8226 3.4256 3.0417 2.9329 2.8539 3.1730 2.9786 3.1337 3.6736 3.9291 3.6923 3.8610 3.8410 4.3261 3.7767 3.5693 3.9014 3.9394 4.0112 3.6317 3.9078 4.1699 3.8923 3.9354 4.1226 4.0025 3.8409 4.0275 4.5315 3.8876 0.9983 0.9949 0.9977 1.0146 1.0132 1.0280 0.9974 1.0009 0.9917 1.0056 1.0111 0.9940 0.9894 0.9931 1.0077 0.9979
dispcorr: -0.043686972 hartree
energy: -2305.904240851891
dipole: 38.34918 -36.68981 1.65936 16.00974 -15.81069 0.19904 -15.19100 16.40092 1.20991
magnitude: 2.06325 au
magnitude: 5.24436 debye
