program: Orca
programVersion: 5.0.2
elementType: Cl F F F O O N N N N N N N N N N C C C C C C C C C C C C C C C C C C C C C C H H H H H H H H H H H H H H H H
charge: 0
multiplicity: 1
keywords: wb97x-d3
keywords: def2-TZVPP
keywords: def2/J RIJCOSX
keywords: DEFGRID2
keywords: scfconv7
keywords: smallprint printgap noloewdin
keywords: NOSOSCF
formula: C22H16ClF3N10O2
InChI: InChI=1/C22H16ClF3N10O2/c1-11-6-12(9-27)7-14(19(37)28-2)17(11)30-20(38)16-8-13(10-35-33-21(31-34-35)22(24,25)26)32-36(16)18-15(23)4-3-5-29-18/h3-8,28,30H,10H2,1-2H3
54 atoms
Cl 2.485644 2.008643 4.114565
F  -5.458736 -0.728833 -2.028873
F  -3.456472 -0.204836 -2.632128
F  -3.936082 -2.240024 -2.092653
O  3.627225 0.178299 1.19492
O  2.129315 0.776671 -1.976737
N  1.197767 1.662237 1.460893
N  2.529723 -1.391581 0.016843
N  -0.025375 2.009697 1.828559
N  -2.968405 0.111168 1.277686
N  2.487629 3.28179 0.385344
N  -2.916828 0.218058 -0.020628
N  -3.828064 -0.771035 1.700317
N  -0.099286 1.146945 -1.758236
N  -4.379901 -1.282039 0.653335
N  -2.162918 -4.158044 -3.965529
C  1.290394 0.340656 1.167591
C  -0.735874 0.900378 1.796452
C  1.497676 -1.905082 -0.781707
C  0.042974 -0.191453 1.387449
C  -2.172606 0.922694 2.183208
C  2.575551 -0.27189 0.779902
C  1.29732 -3.292084 -0.740042
C  0.718546 -1.095824 -1.61902
C  2.224002 2.641851 1.499069
C  0.333815 -3.854568 -1.562046
C  -0.258097 -1.678078 -2.411859
C  -0.44125 -3.056024 -2.395771
C  2.106998 -4.155903 0.176338
C  0.989173 0.372297 -1.78914
C  2.873496 2.900232 2.699473
C  3.846351 3.883214 2.722667
C  -3.812051 -0.6658 -0.38382
C  3.422715 4.22214 0.400615
C  4.125672 4.557363 1.545992
C  -1.405347 -3.654057 -3.259543
C  -4.167341 -0.961142 -1.800597
C  -0.102133 2.571876 -1.986071
H  -0.267884 -1.217444 1.276543
H  -2.557855 1.942192 2.172629
H  -2.332033 0.50865 3.178155
H  3.419479 -1.873155 -0.050697
H  0.179476 -4.925787 -1.547249
H  -0.84424 -1.069784 -3.086926
H  3.161629 -4.17651 -0.108439
H  2.058162 -3.800325 1.20681
H  1.746722 -5.182785 0.157444
H  4.376576 4.113955 3.636611
H  -0.977942 0.730707 -1.486442
H  3.616301 4.727865 -0.536982
H  4.879501 5.331759 1.520531
H  -0.688255 2.815292 -2.873131
H  0.910355 2.933804 -2.13216
H  -0.536439 3.092381 -1.133263
elementType: Cl F O N C H
totalener: -2305.86525319 hartree
nucrepener: 4678.30949407 hartree
electener: -6984.17474726 hartree
twoeener: 5484.53303798 hartree
cpcmener: -0.06366913 hartree
kineticenergy: 2298.17956766 hartree
xcener: -190.406225076720 hartree
chargesum: -0.0000000
charge: -0.053757 -0.161804 -0.163984 -0.161705 -0.445688 -0.481033 0.235706 -0.120948 -0.275951 0.266807 -0.326671 -0.296481 -0.125074 -0.184403 -0.206528 -0.102822 -0.128475 -0.024928 0.025829 -0.033692 -0.017567 0.285307 -0.020724 0.058181 0.164022 -0.138771 -0.247613 0.238060 -0.249690 0.309864 0.020273 -0.087046 0.107848 0.004103 -0.101474 -0.152412 0.514297 -0.164899 0.184846 0.136118 0.128831 0.179420 0.138794 0.144026 0.112855 0.114971 0.097966 0.148455 0.213522 0.144495 0.163258 0.124204 0.105278 0.106803
qa: -0.0538 -0.1618 -0.1640 -0.1617 -0.4457 -0.4810 0.2357 -0.1209 -0.2760 0.2668 -0.3267 -0.2965 -0.1251 -0.1844 -0.2065 -0.1028 -0.1285 -0.0249 0.0258 -0.0337 -0.0176 0.2853 -0.0207 0.0582 0.1640 -0.1388 -0.2476 0.2381 -0.2497 0.3099 0.0203 -0.0870 0.1078 0.0041 -0.1015 -0.1524 0.5143 -0.1649 0.1848 0.1361 0.1288 0.1794 0.1388 0.1440 0.1129 0.1150 0.0980 0.1485 0.2135 0.1445 0.1633 0.1242 0.1053 0.1068
va: 1.2645 1.1502 1.1406 1.1454 2.0602 2.0426 3.3002 3.1987 2.8884 3.4073 3.0558 2.8948 2.8348 3.1954 2.9965 3.1270 3.7759 3.9584 3.8200 3.6670 3.8460 4.2674 3.8170 3.4963 3.8914 3.9952 4.0531 3.6604 3.9126 4.1591 4.0514 3.9789 4.0999 4.0301 3.8793 4.0203 4.4890 3.8707 0.9783 1.0032 0.9981 1.0136 1.0117 1.0374 0.9921 0.9979 1.0041 1.0041 0.9914 0.9960 0.9878 0.9955 1.0239 0.9981
dispcorr: -0.038846556 hartree
energy: -2305.904099745019
dipole: 24.12594 -22.81841 1.30754 3.48401 -2.24726 1.23675 0.93586 1.48065 2.41652
magnitude: 3.01310 au
magnitude: 7.65868 debye
