program: Orca
programVersion: 5.0.2
elementType: I S F F F F F F F O O O O N N C C C C C C C C C C C C C C C C C C C C C C C H H H H H H H H H H H H H H H H H H H H H H
elementType: I
charge: 0
multiplicity: 1
keywords: wb97x-d3
keywords: def2-TZVPP
keywords: def2/J RIJCOSX
keywords: DEFGRID2
keywords: scfconv7
keywords: smallprint printgap noloewdin
keywords: NOSOSCF
formula: C23H22F7IN2O4S
InChI: InChI=1/C23H22F7IN2O4S/c1-12-10-13(21(24,22(25,26)27)23(28,29)30)8-9-16(12)32-18(34)14-6-5-7-15(31)17(14)19(35)33-20(2,3)11-38(4,36)37/h5-10,32-33H,11H2,1-4H3
60 atoms
I  -5.894204 -0.196956 -0.255779
S  0.151253 -2.492422 1.33538
F  6.086012 0.681066 0.866955
F  5.749976 2.541145 -1.189475
F  7.418449 1.197405 -1.285968
F  5.742693 0.912222 -2.598413
F  6.920407 -1.436943 -0.604942
F  5.126791 -1.78728 0.525731
F  5.023737 -1.554466 -1.611804
O  -0.255236 -1.250562 2.004599
O  0.018408 -3.733979 2.104346
O  -1.989147 -0.026624 -1.743703
O  -0.424323 3.048433 -1.128431
N  -2.638339 -1.10684 0.151299
N  -0.13701 1.450027 0.456135
C  -2.256155 -2.486566 -0.152451
C  -0.726414 -2.644818 -0.223264
C  -2.812717 -2.940161 -1.505618
C  -2.887265 -3.35629 0.932954
C  1.847258 -2.353892 0.830974
C  -2.542796 -0.045771 -0.649724
C  -3.159382 1.214702 -0.105627
C  5.413139 0.390131 -0.294799
C  3.940858 0.701297 -0.137317
C  -2.337395 2.332906 0.064793
C  2.108464 1.285504 1.344465
C  1.236636 1.221139 0.255805
C  3.453195 1.004866 1.127702
C  3.059079 0.656138 -1.213199
C  6.094599 1.27036 -1.367299
C  5.630777 -1.123548 -0.511389
C  -4.523522 1.351294 0.145793
C  1.714835 0.910065 -1.010281
C  -0.879724 2.301662 -0.277162
C  -2.860723 3.54007 0.504785
C  1.62215 1.647822 2.71314
C  -5.046506 2.554308 0.602373
C  -4.210427 3.64177 0.794633
H  -0.292675 -1.904601 -0.898916
H  -0.471946 -3.634524 -0.607162
H  -2.317784 -2.469109 -2.351432
H  -3.87978 -2.724294 -1.5627
H  -2.682034 -4.018038 -1.601386
H  -3.973764 -3.320225 0.841476
H  -2.632384 -3.027043 1.941145
H  -2.574408 -4.393481 0.820737
H  -3.053963 -0.954116 1.059416
H  2.44238 -2.230807 1.735007
H  2.142282 -3.266568 0.316338
H  1.972493 -1.498341 0.17295
H  4.115701 1.044251 1.9809
H  3.377159 0.412879 -2.215881
H  1.032412 0.829768 -1.844908
H  -0.578143 0.96058 1.224859
H  -2.211284 4.395459 0.635683
H  2.45394 1.730496 3.410084
H  0.935316 0.899411 3.110929
H  1.091856 2.600567 2.709371
H  -6.105142 2.653117 0.798228
H  -4.621516 4.574644 1.155196
elementType: I S F O N C H
totalener: -2695.32924414 hartree
nucrepener: 5429.36055468 hartree
electener: -8124.68979882 hartree
twoeener: 6504.86303464 hartree
cpcmener: -0.06915313 hartree
kineticenergy: 2502.54322907 hartree
xcener: -212.364651776722 hartree
chargesum: 0.0000000
charge: 0.062485 0.856117 -0.199416 -0.157839 -0.156651 -0.156872 -0.157573 -0.158963 -0.160040 -0.573842 -0.582649 -0.535551 -0.517667 -0.160840 -0.117784 0.216728 -0.243669 -0.308868 -0.308391 -0.245175 0.297491 -0.069476 0.198492 -0.071923 0.021840 -0.164268 0.206996 -0.058158 -0.084115 0.485589 0.468571 -0.015836 -0.267701 0.381078 -0.146488 -0.252209 -0.137132 -0.159887 0.141528 0.159860 0.110830 0.108894 0.112752 0.118910 0.098055 0.112381 0.191296 0.142712 0.161558 0.103904 0.126928 0.146136 0.136777 0.212890 0.153430 0.100359 0.105654 0.112207 0.152994 0.163538
qa: 0.0625 0.8561 -0.1994 -0.1578 -0.1567 -0.1569 -0.1576 -0.1590 -0.1600 -0.5738 -0.5826 -0.5356 -0.5177 -0.1608 -0.1178 0.2167 -0.2437 -0.3089 -0.3084 -0.2452 0.2975 -0.0695 0.1985 -0.0719 0.0218 -0.1643 0.2070 -0.0582 -0.0841 0.4856 0.4686 -0.0158 -0.2677 0.3811 -0.1465 -0.2522 -0.1371 -0.1599 0.1415 0.1599 0.1108 0.1089 0.1128 0.1189 0.0981 0.1124 0.1913 0.1427 0.1616 0.1039 0.1269 0.1461 0.1368 0.2129 0.1534 0.1004 0.1057 0.1122 0.1530 0.1635
va: 1.2199 5.4396 1.1001 1.1585 1.1658 1.1585 1.1649 1.1559 1.1542 1.8665 1.8836 1.9549 1.9832 3.2222 3.1473 3.9071 3.8402 3.9001 3.9199 3.8936 4.0813 3.7145 4.0606 3.6292 3.6327 3.9320 3.4920 3.8836 3.9764 4.4745 4.4701 4.0041 4.0401 4.0863 3.9541 3.9148 3.8843 3.9453 1.0170 1.0150 1.0196 1.0070 1.0036 1.0026 1.0226 1.0074 0.9966 1.0125 1.0101 1.0127 1.0269 1.0186 1.0292 0.9913 1.0049 1.0053 1.0073 0.9967 0.9939 0.9887
dispcorr: -0.046012204 hartree
energy: -2695.375256348717
dipole: 372.14646 -373.83067 -1.68420 1.18367 -2.58454 -1.40087 30.74156 -29.21965 1.52192
magnitude: 2.66743 au
magnitude: 6.78008 debye
