program: Orca
programVersion: 5.0.2
elementType: I S F F F F F F F O O O O N N C C C C C C C C C C C C C C C C C C C C C C C H H H H H H H H H H H H H H H H H H H H H H
elementType: I
charge: 0
multiplicity: 1
keywords: wb97x-d3
keywords: def2-TZVPP
keywords: def2/J RIJCOSX
keywords: DEFGRID2
keywords: scfconv7
keywords: smallprint printgap noloewdin
keywords: NOSOSCF
formula: C23H22F7IN2O4S
InChI: InChI=1/C23H22F7IN2O4S/c1-12-10-13(21(24,22(25,26)27)23(28,29)30)8-9-16(12)32-18(34)14-6-5-7-15(31)17(14)19(35)33-20(2,3)11-38(4,36)37/h5-10,32-33H,11H2,1-4H3
60 atoms
I  -5.902694 -0.298142 0.014009
S  0.275412 -2.687077 0.942515
F  5.435576 0.615307 -2.317341
F  4.731638 -1.781363 -1.392705
F  6.805314 -1.366312 -1.042168
F  5.410508 -1.323466 0.59866
F  7.485461 1.309443 -0.935914
F  5.89867 2.68551 -0.500876
F  6.481546 1.213205 0.959727
O  -0.111161 -1.597666 1.847575
O  0.223135 -4.046823 1.488851
O  -2.126095 0.111971 -1.768507
O  -0.58499 3.154096 -1.068584
N  -2.586677 -1.125144 0.084254
N  -0.17554 1.460229 0.385798
C  -2.224034 -2.469553 -0.369392
C  -0.702897 -2.603325 -0.562883
C  -2.873981 -2.804037 -1.715777
C  -2.775629 -3.440594 0.673291
C  1.92466 -2.39591 0.352639
C  -2.591705 -0.005596 -0.640637
C  -3.203833 1.195231 0.030785
C  5.268096 0.463271 -0.962677
C  3.840282 0.783857 -0.583186
C  -2.405967 2.331638 0.198239
C  2.133776 1.243744 1.079683
C  1.176725 1.252436 0.061772
C  3.456665 0.990048 0.738044
C  2.875283 0.806234 -1.583146
C  5.570161 -1.026578 -0.687163
C  6.303986 1.429826 -0.3412
C  -4.551163 1.276305 0.377778
C  1.550556 1.033956 -1.257586
C  -0.975153 2.350427 -0.23829
C  -2.934416 3.503111 0.71951
C  1.753657 1.496483 2.505783
C  -5.078732 2.443242 0.915588
C  -4.26563 3.549887 1.096453
H  -0.31363 -1.766029 -1.146123
H  -0.472783 -3.521399 -1.107549
H  -2.438651 -2.256883 -2.548246
H  -3.942467 -2.591041 -1.679695
H  -2.749318 -3.868105 -1.916517
H  -3.865401 -3.406527 0.660193
H  -2.452751 -3.20284 1.686922
H  -2.469911 -4.459846 0.445109
H  -2.947015 -1.059744 1.025771
H  2.587016 -2.386108 1.21742
H  2.207091 -3.200993 -0.322662
H  1.964196 -1.442077 -0.165749
H  4.175498 0.972668 1.545277
H  3.127616 0.634751 -2.619173
H  0.803492 1.007365 -2.038956
H  -0.549485 0.952877 1.176611
H  -2.303524 4.373515 0.842256
H  1.248665 2.45646 2.620068
H  2.633171 1.50355 3.146564
H  1.076928 0.729316 2.886124
H  -6.124118 2.498706 1.185423
H  -4.680933 4.454949 1.518118
elementType: I S F O N C H
totalener: -2695.32924225 hartree
nucrepener: 5427.14625340 hartree
electener: -8122.47549565 hartree
twoeener: 6502.36434898 hartree
cpcmener: -0.07029470 hartree
kineticenergy: 2502.53544089 hartree
xcener: -212.362184692237 hartree
chargesum: -0.0000000
charge: 0.063494 0.853902 -0.199161 -0.160723 -0.157313 -0.160333 -0.155947 -0.156854 -0.157430 -0.574784 -0.582825 -0.533140 -0.512918 -0.159265 -0.115788 0.222798 -0.247142 -0.309436 -0.315082 -0.231465 0.305727 -0.085986 0.205971 -0.054068 0.026627 -0.161864 0.205605 -0.074304 -0.107893 0.466450 0.485245 -0.015227 -0.246457 0.382177 -0.148967 -0.250882 -0.138113 -0.157347 0.141017 0.157840 0.112931 0.108869 0.111208 0.118892 0.100040 0.113189 0.190487 0.143327 0.160468 0.088650 0.134609 0.144590 0.137902 0.200566 0.153201 0.113589 0.099663 0.104447 0.153721 0.163509
qa: 0.0635 0.8539 -0.1992 -0.1607 -0.1573 -0.1603 -0.1559 -0.1569 -0.1574 -0.5748 -0.5828 -0.5331 -0.5129 -0.1593 -0.1158 0.2228 -0.2471 -0.3094 -0.3151 -0.2315 0.3057 -0.0860 0.2060 -0.0541 0.0266 -0.1619 0.2056 -0.0743 -0.1079 0.4665 0.4852 -0.0152 -0.2465 0.3822 -0.1490 -0.2509 -0.1381 -0.1573 0.1410 0.1578 0.1129 0.1089 0.1112 0.1189 0.1000 0.1132 0.1905 0.1433 0.1605 0.0887 0.1346 0.1446 0.1379 0.2006 0.1532 0.1136 0.0997 0.1044 0.1537 0.1635
va: 1.2199 5.4394 1.0993 1.1552 1.1647 1.1544 1.1659 1.1592 1.1578 1.8637 1.8814 1.9556 1.9870 3.2260 3.1598 3.8905 3.8412 3.8992 3.9185 3.8887 4.0768 3.7336 4.0452 3.6472 3.6267 3.9546 3.5056 3.9068 3.9785 4.4723 4.4771 4.0097 3.9939 4.0877 3.9545 3.9164 3.8867 3.9442 1.0156 1.0165 1.0198 1.0074 1.0038 1.0026 1.0227 1.0081 0.9973 1.0138 1.0109 1.0191 1.0283 1.0162 1.0288 0.9960 1.0056 0.9964 1.0067 1.0043 0.9935 0.9887
dispcorr: -0.046001688 hartree
energy: -2695.375243937158
dipole: 372.94939 -374.50125 -1.55186 6.96876 -8.10852 -1.13976 6.08589 -4.38824 1.69765
magnitude: 2.56697 au
magnitude: 6.52473 debye
