program: Orca
programVersion: 5.0.2
elementType: I S F F F F F F F O O O O N N C C C C C C C C C C C C C C C C C C C C C C C H H H H H H H H H H H H H H H H H H H H H H
elementType: I
charge: 0
multiplicity: 1
keywords: wb97x-d3
keywords: def2-TZVPP
keywords: def2/J RIJCOSX
keywords: DEFGRID2
keywords: scfconv7
keywords: smallprint printgap noloewdin
keywords: NOSOSCF
formula: C23H22F7IN2O4S
InChI: InChI=1/C23H22F7IN2O4S/c1-12-10-13(21(24,22(25,26)27)23(28,29)30)8-9-16(12)32-18(34)14-6-5-7-15(31)17(14)19(35)33-20(2,3)11-38(4,36)37/h5-10,32-33H,11H2,1-4H3
60 atoms
I  -6.281523 0.295894 0.523869
S  0.19575 -2.530252 -0.678925
F  6.12225 0.52046 1.430835
F  7.86244 1.0053 -0.399212
F  6.462865 0.910779 -2.025011
F  6.318531 2.486446 -0.563168
F  7.014524 -1.609213 -0.00614
F  5.032482 -1.828294 0.785936
F  5.312557 -1.490344 -1.320473
O  0.483233 -3.663761 -1.564163
O  -0.056138 -1.231995 -1.315692
O  -3.312994 -0.877055 2.037654
O  -0.63627 0.433224 1.540553
N  -2.846266 -1.220479 -0.170033
N  0.154214 1.867719 -0.032033
C  -2.582368 -2.66029 -0.202023
C  -1.189686 -2.966521 0.383962
C  -2.724911 -3.106148 -1.657858
C  -3.597791 -3.454528 0.624236
C  1.563086 -2.335298 0.436962
C  -3.134709 -0.470737 0.898487
C  -3.303371 0.994446 0.578379
C  5.646606 0.345074 0.153198
C  4.200758 0.782831 0.080803
C  -2.199269 1.848159 0.466397
C  2.214744 1.374475 -1.184206
C  1.508293 1.503157 0.017982
C  3.553001 1.008655 -1.130234
C  3.488289 0.933516 1.263474
C  6.589967 1.196473 -0.731164
C  5.762749 -1.171758 -0.111439
C  -4.577361 1.524344 0.411689
C  2.154925 1.300216 1.23042
C  -0.827928 1.30859 0.7117
C  -2.388896 3.200927 0.204875
C  1.557418 1.634833 -2.505579
C  -4.766427 2.875407 0.151484
C  -3.667159 3.710854 0.053018
H  -1.081172 -4.03586 0.572756
H  -1.05039 -2.447789 1.334062
H  -3.765876 -3.011549 -1.967111
H  -2.439712 -4.151528 -1.763618
H  -2.124268 -2.514621 -2.348349
H  -3.508974 -4.509832 0.366543
H  -4.613281 -3.136744 0.386436
H  -3.446474 -3.363022 1.696327
H  -2.671955 -0.725904 -1.032802
H  2.429982 -2.079137 -0.170959
H  1.349939 -1.5371 1.143194
H  1.743129 -3.270461 0.963573
H  4.067864 0.903652 -2.074949
H  3.95205 0.782498 2.227175
H  1.631612 1.442422 2.164202
H  -0.128419 2.453042 -0.805387
H  -1.543732 3.874057 0.146422
H  2.2410 1.424267 -3.325465
H  1.247275 2.678156 -2.601987
H  0.66801 1.020814 -2.647378
H  -5.761639 3.278458 0.025019
H  -3.810743 4.765162 -0.139312
elementType: I S F O N C H
totalener: -2695.33075469 hartree
nucrepener: 5387.44085472 hartree
electener: -8082.77160941 hartree
twoeener: 6465.21576274 hartree
cpcmener: -0.07122715 hartree
kineticenergy: 2502.52374061 hartree
xcener: -212.361109374440 hartree
chargesum: 0.0000000
charge: 0.069600 0.866166 -0.199619 -0.156632 -0.157727 -0.157051 -0.158291 -0.160252 -0.161748 -0.586056 -0.571778 -0.530621 -0.512633 -0.143030 -0.138366 0.273851 -0.267045 -0.329878 -0.307011 -0.262771 0.257190 -0.096253 0.213279 -0.050106 0.094885 -0.096453 0.174924 -0.102179 -0.133146 0.485328 0.470576 0.019614 -0.235136 0.366415 -0.178397 -0.257095 -0.166046 -0.136914 0.156022 0.144472 0.116468 0.111074 0.099879 0.109890 0.106272 0.109914 0.182863 0.120168 0.136821 0.162694 0.134969 0.143520 0.144104 0.192013 0.149772 0.099364 0.112741 0.109736 0.152915 0.164730
qa: 0.0696 0.8662 -0.1996 -0.1566 -0.1577 -0.1571 -0.1583 -0.1603 -0.1617 -0.5861 -0.5718 -0.5306 -0.5126 -0.1430 -0.1384 0.2739 -0.2670 -0.3299 -0.3070 -0.2628 0.2572 -0.0963 0.2133 -0.0501 0.0949 -0.0965 0.1749 -0.1022 -0.1331 0.4853 0.4706 0.0196 -0.2351 0.3664 -0.1784 -0.2571 -0.1660 -0.1369 0.1560 0.1445 0.1165 0.1111 0.0999 0.1099 0.1063 0.1099 0.1829 0.1202 0.1368 0.1627 0.1350 0.1435 0.1441 0.1920 0.1498 0.0994 0.1127 0.1097 0.1529 0.1647
va: 1.2431 5.4172 1.0981 1.1651 1.1574 1.1588 1.1637 1.1551 1.1530 1.8759 1.8737 1.9503 1.9801 3.2253 3.2784 3.7878 3.8736 3.9244 3.9009 3.8861 4.1717 3.7288 4.0265 3.6236 3.6156 3.8759 3.6324 3.9595 3.9927 4.4762 4.4634 3.9652 3.9757 4.0084 3.9652 3.9107 3.9331 3.9280 1.0177 1.0128 1.0043 1.0062 1.0241 1.0038 1.0086 1.0193 1.0048 1.0246 1.0095 1.0067 1.0288 1.0165 1.0187 0.9912 1.0126 1.0064 0.9910 1.0065 0.9956 0.9884
dispcorr: -0.044327893 hartree
energy: -2695.375082583039
dipole: 397.13133 -398.03898 -0.90765 -34.55531 36.71697 2.16167 -42.79943 41.23832 -1.56111
magnitude: 2.81668 au
magnitude: 7.15943 debye
