program: Orca
programVersion: 5.0.2
elementType: I S F F F F F F F O O O O N N C C C C C C C C C C C C C C C C C C C C C C C H H H H H H H H H H H H H H H H H H H H H H
elementType: I
charge: 0
multiplicity: 1
keywords: wb97x-d3
keywords: def2-TZVPP
keywords: def2/J RIJCOSX
keywords: DEFGRID2
keywords: scfconv7
keywords: smallprint printgap noloewdin
keywords: NOSOSCF
formula: C23H22F7IN2O4S
InChI: InChI=1/C23H22F7IN2O4S/c1-12-10-13(21(24,22(25,26)27)23(28,29)30)8-9-16(12)32-18(34)14-6-5-7-15(31)17(14)19(35)33-20(2,3)11-38(4,36)37/h5-10,32-33H,11H2,1-4H3
60 atoms
I  -5.953919 -0.054492 -0.132662
S  0.11885 -2.614305 1.392418
F  5.97614 0.139714 1.244643
F  5.800758 2.036966 -1.694554
F  6.003788 2.627692 0.362944
F  7.543682 1.457888 -0.572565
F  7.11273 -1.273114 -0.591644
F  5.065056 -1.900552 -0.441105
F  5.718323 -0.730516 -2.129367
O  -0.185207 -1.349343 2.072456
O  -0.001811 -3.839726 2.18317
O  -2.341922 -0.188214 -1.735099
O  -0.275504 3.123891 -0.795888
N  -2.670511 -1.078703 0.335933
N  -0.146763 1.167118 0.32634
C  -2.398482 -2.49912 0.107813
C  -0.891425 -2.753902 -0.086324
C  -3.094382 -3.022439 -1.152505
C  -2.976408 -3.243199 1.31142
C  1.774488 -2.549415 0.746143
C  -2.676948 -0.090765 -0.565561
C  -3.162745 1.230424 -0.021848
C  5.490665 0.373141 -0.019066
C  3.996821 0.60313 0.037688
C  -2.278934 2.302775 0.142927
C  1.841129 0.826529 -1.068498
C  1.247099 1.008094 0.183235
C  3.219355 0.638457 -1.11393
C  3.386895 0.777596 1.273867
C  6.227726 1.641875 -0.499882
C  5.85855 -0.900711 -0.816831
C  -4.517379 1.443197 0.226861
C  2.021914 0.983328 1.336007
C  -0.815152 2.231272 -0.167146
C  -2.750391 3.5388 0.570363
C  1.064006 0.795979 -2.34747
C  -4.984066 2.67257 0.670461
C  -4.092553 3.716478 0.852671
H  -0.479506 -2.064874 -0.826892
H  -0.727899 -3.769611 -0.453247
H  -4.142244 -2.722088 -1.162908
H  -3.05959 -4.112149 -1.14968
H  -2.627549 -2.678226 -2.072312
H  -4.063077 -3.149922 1.307643
H  -2.617902 -2.852615 2.264245
H  -2.731384 -4.302808 1.264328
H  -2.925233 -0.827786 1.280378
H  1.887725 -1.697585 0.080351
H  2.451444 -2.458297 1.595171
H  1.983141 -3.474248 0.21052
H  3.655737 0.496559 -2.092833
H  3.95064 0.757671 2.19493
H  1.54919 1.126929 2.298806
H  -0.585824 0.58838 1.031412
H  -2.060953 4.362968 0.696344
H  0.064464 0.386856 -2.215361
H  1.57764 0.186826 -3.090565
H  0.952133 1.796239 -2.768427
H  -6.037032 2.824447 0.864719
H  -4.452847 4.674792 1.201857
elementType: I S F O N C H
totalener: -2695.33403168 hartree
nucrepener: 5411.49469299 hartree
electener: -8106.82872467 hartree
twoeener: 6486.82268676 hartree
cpcmener: -0.05335495 hartree
kineticenergy: 2502.54493612 hartree
xcener: -212.361813708985 hartree
chargesum: 0.0000000
charge: 0.060913 0.852232 -0.197295 -0.156019 -0.157223 -0.157468 -0.153571 -0.155302 -0.157325 -0.567160 -0.561296 -0.492056 -0.478449 -0.166053 -0.127991 0.230073 -0.254860 -0.309054 -0.310775 -0.261023 0.247869 -0.086145 0.204168 -0.067002 0.052914 -0.156312 0.189797 -0.054600 -0.105861 0.467219 0.473481 -0.010982 -0.251181 0.363279 -0.144208 -0.265197 -0.139038 -0.157476 0.137528 0.156470 0.108554 0.109515 0.114087 0.116553 0.098503 0.111046 0.190347 0.117430 0.141486 0.159803 0.129101 0.142337 0.136479 0.209577 0.145217 0.100818 0.106279 0.117288 0.150413 0.160148
qa: 0.0609 0.8522 -0.1973 -0.1560 -0.1572 -0.1575 -0.1536 -0.1553 -0.1573 -0.5672 -0.5613 -0.4921 -0.4784 -0.1661 -0.1280 0.2301 -0.2549 -0.3091 -0.3108 -0.2610 0.2479 -0.0861 0.2042 -0.0670 0.0529 -0.1563 0.1898 -0.0546 -0.1059 0.4672 0.4735 -0.0110 -0.2512 0.3633 -0.1442 -0.2652 -0.1390 -0.1575 0.1375 0.1565 0.1086 0.1095 0.1141 0.1166 0.0985 0.1110 0.1903 0.1174 0.1415 0.1598 0.1291 0.1423 0.1365 0.2096 0.1452 0.1008 0.1063 0.1173 0.1504 0.1601
va: 1.2260 5.4557 1.1011 1.1614 1.1621 1.1633 1.1690 1.1526 1.1565 1.8675 1.9119 2.0062 2.0377 3.1632 3.0925 3.8725 3.8687 3.8973 3.9258 3.8933 4.1438 3.6997 4.0464 3.6430 3.5766 3.9581 3.5118 3.9179 3.9518 4.4786 4.4709 4.0161 4.0384 4.1042 3.9582 3.8796 3.9068 3.9504 1.0074 1.0157 1.0091 1.0041 1.0194 1.0035 1.0222 1.0083 0.9965 1.0089 1.0130 1.0093 1.0313 1.0149 1.0250 1.0055 1.0136 1.0166 1.0042 1.0057 0.9951 0.9905
dispcorr: -0.046208108 hartree
energy: -2695.380239786957
dipole: 373.21381 -374.86827 -1.65446 -12.42635 10.95693 -1.46941 12.53557 -11.85712 0.67845
magnitude: 2.31446 au
magnitude: 5.88288 debye
