program: Orca
programVersion: 5.0.2
elementType: I S F F F F F F F O O O O N N C C C C C C C C C C C C C C C C C C C C C C C H H H H H H H H H H H H H H H H H H H H H H
elementType: I
charge: 0
multiplicity: 1
keywords: wb97x-d3
keywords: def2-TZVPP
keywords: def2/J RIJCOSX
keywords: DEFGRID2
keywords: scfconv7
keywords: smallprint printgap noloewdin
keywords: NOSOSCF
formula: C23H22F7IN2O4S
InChI: InChI=1/C23H22F7IN2O4S/c1-12-10-13(21(24,22(25,26)27)23(28,29)30)8-9-16(12)32-18(34)14-6-5-7-15(31)17(14)19(35)33-20(2,3)11-38(4,36)37/h5-10,32-33H,11H2,1-4H3
60 atoms
I  -5.887176 -0.312131 -0.195301
S  0.160152 -2.399871 1.097603
F  5.274103 0.300927 -2.433074
F  4.652936 -1.947066 -1.111871
F  6.750663 -1.494979 -1.067963
F  5.561044 -1.228046 0.704052
F  7.432354 1.16324 -1.217402
F  5.83803 2.588665 -1.030672
F  6.444159 1.41244 0.672797
O  -0.255702 -1.153369 1.743809
O  0.005968 -3.643692 1.835151
O  -1.910369 0.153848 -1.683334
O  -0.578039 3.271344 -0.859962
N  -2.660397 -1.158997 0.008776
N  -0.146441 1.50534 0.500982
C  -2.202984 -2.462384 -0.45531
C  -0.664464 -2.52909 -0.498461
C  -2.706848 -2.749868 -1.874371
C  -2.804182 -3.502438 0.489656
C  1.870561 -2.255315 0.615471
C  -2.522469 0.009134 -0.64505
C  -3.181757 1.181445 0.033123
C  5.209247 0.331613 -1.062437
C  3.80855 0.701868 -0.624687
C  -2.407733 2.318266 0.28966
C  2.178935 1.203443 1.104036
C  1.186559 1.28053 0.123148
C  3.477607 0.903019 0.711901
C  2.813679 0.8151 -1.588506
C  5.563647 -1.105513 -0.621886
C  6.255879 1.389974 -0.646946
C  -4.542603 1.228051 0.334352
C  1.513413 1.101293 -1.214775
C  -0.960328 2.409217 -0.108345
C  -2.977788 3.447417 0.857674
C  1.854085 1.422034 2.550497
C  -5.108725 2.350535 0.922258
C  -4.318515 3.453593 1.196801
H  -0.277227 -1.725471 -1.128389
H  -0.344411 -3.483349 -0.922467
H  -2.255465 -2.098321 -2.618043
H  -3.787671 -2.615756 -1.916999
H  -2.485607 -3.783886 -2.1417
H  -3.888766 -3.510562 0.377241
H  -2.57106 -3.312008 1.536682
H  -2.431997 -4.497847 0.25377
H  -3.044839 -1.125915 0.93867
H  2.451394 -2.107873 1.524509
H  2.182364 -3.177856 0.130969
H  2.007286 -1.407232 -0.049604
H  4.226445 0.837747 1.48816
H  3.032245 0.676029 -2.636259
H  0.740445 1.164963 -1.96782
H  -0.53114 0.855076 1.172289
H  -2.365859 4.322422 1.030506
H  1.275613 2.335303 2.690928
H  2.760638 1.506392 3.147594
H  1.265093 0.598379 2.957047
H  -6.16472 2.375818 1.151474
H  -4.762201 4.327814 1.653668
totalener: -2695.29863037 hartree
nucrepener: 5460.81722544 hartree
electener: -8156.11585581 hartree
twoeener: 6536.47574723 hartree
kineticenergy: 2502.65147369 hartree
xcener: -212.374689671380 hartree
chargesum: -0.0000000
charge: 0.057597 0.817655 -0.189624 -0.163722 -0.144348 -0.161407 -0.146917 -0.146355 -0.159286 -0.532308 -0.476738 -0.401547 -0.351417 -0.191952 -0.163476 0.166290 -0.272218 -0.283322 -0.280286 -0.261227 0.270577 -0.068204 0.201743 -0.104489 0.002851 -0.169979 0.227401 -0.062042 -0.044495 0.458459 0.471550 -0.080325 -0.233877 0.310106 -0.101789 -0.268040 -0.104392 -0.134175 0.141476 0.139625 0.126420 0.097298 0.094432 0.112973 0.103077 0.098933 0.162637 0.133284 0.151525 0.086617 0.113884 0.128700 0.132165 0.198988 0.130540 0.107490 0.086669 0.109585 0.125077 0.132330
qa: 0.0576 0.8177 -0.1896 -0.1637 -0.1443 -0.1614 -0.1469 -0.1464 -0.1593 -0.5323 -0.4767 -0.4015 -0.3514 -0.1920 -0.1635 0.1663 -0.2722 -0.2833 -0.2803 -0.2612 0.2706 -0.0682 0.2017 -0.1045 0.0029 -0.1700 0.2274 -0.0620 -0.0445 0.4585 0.4716 -0.0803 -0.2339 0.3101 -0.1018 -0.2680 -0.1044 -0.1342 0.1415 0.1396 0.1264 0.0973 0.0944 0.1130 0.1031 0.0989 0.1626 0.1333 0.1515 0.0866 0.1139 0.1287 0.1322 0.1990 0.1305 0.1075 0.0867 0.1096 0.1251 0.1323
va: 1.2465 5.5164 1.1117 1.1479 1.1841 1.1499 1.1792 1.1749 1.1539 1.9053 2.0147 2.0991 2.1655 3.1543 3.0845 4.0419 3.8568 3.8804 3.9336 3.9051 4.0796 3.6338 4.0487 3.6963 3.7438 3.9204 3.5818 3.9041 3.9265 4.4806 4.4812 4.1178 4.0091 4.1666 3.9795 3.9113 3.9231 3.9815 1.0222 1.0187 1.0196 1.0141 1.0064 1.0010 1.0230 1.0127 1.0226 1.0160 1.0153 1.0176 1.0367 1.0209 1.0355 1.0128 1.0137 1.0010 1.0093 1.0080 1.0037 1.0003
dispcorr: -0.046829825 hartree
energy: -2695.345460193555
dipole: 371.82136 -372.93628 -1.11492 8.87758 -9.80761 -0.93003 19.96401 -19.13359 0.83042
magnitude: 1.67260 au
magnitude: 4.25142 debye
