program: Gaussian 09
title: 000006637
version: EM64L-G09RevD.01
frameworkgroup: C1[X(C9H13NO2S)]
method: RPBEPBE
basis: SDD
operation: Freq
keyword: #p
keyword: freq=noraman
keyword: PBEPBE/SDD
title: #p freq=noraman PBEPBE/SDD
converged: YES YES NO NO
title: Mulliken charges:
elementType: S O O N C C C C C C C C C H H H H H H H H H H H H H
charge: 0.991154 -0.534775 -0.536434 -0.489224 -0.090662 -0.325642 -0.228363 -0.252916 0.449385 -0.374953 -0.361743 -0.651365 -0.798272 0.296959 0.209021 0.259748 0.285262 0.285797 0.244253 0.244422 0.247836 0.207038 0.218372 0.231961 0.231822 0.241319
chargesum: 0.00000
title: Mulliken charges with hydrogens summed into heavy atoms:
elementType: S O O N C C C C C C C C C
charge: 0.991154 -0.534775 -0.536434 -0.192265 -0.090662 0.143127 0.056899 0.032881 0.449385 -0.130700 -0.117321 0.021880 -0.093169
polarizability: 1.80527725e+02 -5.82310494e+00 1.17357042e+02 4.48285567e+00 1.48450688e+01 1.16461608e+02
1716.lowfreq: -9.2647 -0.0029 -0.0025 0.0011 4.5495 7.4316 33.3794 35.6722 40.6307
frequency: 33.2565 35.3864 40.6037 73.9157 84.6938 114.5848 140.1048 173.3859 225.8213 242.2889 255.3910 283.6852 293.8724 332.6643 380.0887 406.3195 415.2385 423.2134 448.5704 506.9039 579.8110 621.9335 706.0454 728.2517 776.2011 812.7407 822.8723 829.0158 849.7425 904.1145 952.2887 961.5939 981.1796 991.1087 994.3708 1048.1869 1049.7924 1050.1566 1105.7761 1115.8597 1128.5216 1183.2726 1217.7553 1251.4680 1294.6715 1325.2136 1361.5719 1379.9700 1390.2042 1390.5765 1400.2684 1466.3676 1470.8155 1471.0012 1475.2069 1477.4615 1494.5604 1592.8005 1594.7713 2929.0135 2980.5318 2987.4478 3053.3148 3063.1410 3082.1162 3093.1800 3107.6801 3133.3832 3134.8415 3156.5407 3160.4729 3414.3158
redmass: 3.5668 1.0775 3.3031 1.7351 4.2901 4.3966 5.6411 4.6959 7.5000 1.3005 4.6512 3.7587 4.6468 3.3317 3.6988 2.8870 5.7731 3.0199 5.8730 3.0966 5.9855 6.9568 3.1663 1.9360 4.6290 2.5325 1.3546 1.6440 1.2424 1.9453 8.3034 1.2992 1.3862 1.4362 5.3511 3.2391 1.6620 2.5467 1.8380 1.3045 1.6525 1.1502 2.9439 1.2057 1.2677 1.1850 1.2625 6.2866 1.9560 1.5119 1.2198 1.0446 1.1672 2.1107 1.0574 1.0410 1.0830 6.9136 6.0116 1.0684 1.0392 1.0361 1.0926 1.0945 1.0988 1.1001 1.1005 1.0887 1.0890 1.0956 1.0967 1.0760
irintensity: 0.7770 0.5562 0.6456 1.4958 2.4167 2.6524 3.1371 1.7257 6.5666 0.3547 5.3752 1.9291 6.3930 13.9054 9.0433 0.1145 10.9815 12.9552 166.6226 80.2078 31.9061 0.1599 1.9016 24.1268 6.0047 101.2952 61.8273 12.4266 0.4620 2.8368 59.9467 1.2799 0.1250 2.7176 2.5472 8.6667 21.3560 14.6670 27.2847 18.9554 28.3092 6.2263 5.7866 7.6251 2.9210 1.1991 1.3598 0.0951 9.3266 11.1196 15.5171 14.7796 18.1005 22.2364 14.1757 7.5469 15.5365 0.2236 8.1501 50.8219 24.3536 33.6698 1.0084 19.6726 35.3569 14.4412 23.3098 13.2687 6.1824 3.0335 10.0978 16.0724
temp: 298.150 k
press: 1.00000 atm
elementType: 16 8 8 7 6 6 6 6 6 6 6 6 6 1 1 1 1 1 1 1 1 1 1 1 1 1
symmnumber: 1
zpe: 535050.7 jmol-1
zpe.correction: 0.203790 hartree
zpe.thermalcorrener: 0.218646 hartree
zpe.thermalcorrenthalpy: 0.219590 hartree
zpe.thermalcorrgfe: 0.160181 hartree
zpe.sumelectzpe: -952.845746 hartree
zpe.sumelectthermal: -952.830890 hartree
zpe.sumelectthermalent: -952.829946 hartree
zpe.sumelectthermalfe: -952.889355 hartree
dipole: -4.6279 5.6521 -2.4670
dipole: 7.7104
quadrupole: -78.1469 -92.3878 -84.8301
quadrupole: 8.5571 -3.1671 3.6130
quadrupole: 6.9747 -7.2662 0.2915 8.5571 -3.1671 3.6130
hfenergy: -953.049536 hartree
pointgroup: C01 [X(C9H13N1O2S1)]
dipole: -1.8373017 2.1923515 -1.0099711 debye
dipolederiv: 1.9466953 -0.0398044 -0.0123784 0.0497408 1.5413623 -0.1952551 -0.1742782 -0.2868167 1.2388859 -0.7078524 0.0234402 -0.0570181 0.0073825 -0.5011343 -0.0299727 -0.0658367 0.0999239 -0.6347742 -0.6897879 0.0342192 0.010802 0.0151184 -0.7140133 0.0073631 0.0319466 -0.1536804 -0.4984167 -0.6681741 0.0909637 0.0704851 -0.0326326 -0.7040042 0.0525593 0.1748762 0.0794168 -0.3654054 -0.1203772 -0.0107368 -0.002602 -0.0677412 -0.2718705 0.060038 0.0616462 0.0986168 -0.1834759 0.1420011 -0.1708045 0.083465 0.0773592 0.4813167 -0.0132118 0.2807253 0.3049867 0.0238504 -0.1865148 0.0337571 0.0919125 -0.0792164 -0.0627044 -0.0284412 -0.1691863 0.0682752 -0.0293763 -0.1840514 -0.0686897 -0.0463005 0.1398538 -0.0494142 0.0781122 0.1707812 -0.0141547 -0.0498968 0.4477308 -0.1569044 0.0488074 -0.2174061 0.0569204 -0.0130486 0.0955034 -0.0158077 0.0013376 -0.2129485 -0.038054 -0.0782996 -0.0132428 -0.0410878 0.1189112 -0.0888527 0.1201566 -0.0079506 -0.1574809 0.0772081 0.1130912 0.0828344 -0.1209628 0.0725111 0.0918563 0.0620895 0.0288205 0.0440426 0.0121631 0.0210398 -0.1521545 -0.0917949 0.0504737 -0.0695547 -0.0665714 0.1319527 -0.1353974 0.0711972 -0.021193 0.1786692 0.0059688 0.0262639 -0.0907254 0.0372052 0.0630453 0.2315348 -0.1049746 -0.0810716 -0.1152297 0.057172 0.0621681 -0.1158405 -0.0197579 0.0724786 -0.1312497 0.1373967 -0.0140156 0.0388705 -0.1150858 0.012657 -0.0622913 -0.0165164 0.0597237 0.1074151 0.0270438 0.0112611 0.014013 0.0730635 0.0485514 -0.0240605 -0.0293066 -0.0545634 0.1013658 -0.021053 -0.0738133 -0.0185548 0.1246829 -0.0163014 -0.0464665 -0.0381249 0.0766835 0.1272873 0.0501162 0.0428081 0.0202146 0.0968743 -0.06187 0.0239115 -0.0362749 0.0932595 0.0099529 0.0696667 0.0509384 0.0790924 0.0657319 -0.0979394 0.0447532 -0.0967462 0.0245449 -0.0247521 -0.017106 -0.0985636 -0.0083805 0.1115017 -0.064637 -0.0959503 -0.0646604 0.0101204 -0.0719916 0.0581578 -0.0217421 0.1329629 0.0716304 0.0203804 -0.0287249 0.0284762 0.0850065 0.0698814 -0.0119381 -0.0596864 0.0048012 0.0993588 -0.0114632 0.0079458 0.0425874 -0.1632242 0.0491724 -0.0502261 0.0304716 -0.0917331 -0.1587398 -0.057036 0.0191548 -0.07595 0.0595256 -0.0166737 -0.0318655 -0.0340678 -0.1232183 -0.0041292 -0.0833689 -0.0733239 -0.0879788 0.0552688 0.018279 0.0212227 0.0245303 0.0197418 0.1056083 -0.0414251 0.1261502 -0.0474249 -0.0878585 0.0118933 0.0156047 0.0011396 0.0588555 -0.056251 0.1039811 -0.0241588 0.1080373 0.0504381 unknown
polarizability: 180.5943841|-5.2324812|117.6905789|4.6739227|14.8475257|116.0614118 unknown
InChI: InChI=1S/C9H13NO2S/c1-3-10-13(11,12)9-6-4-8(2)5-7-9/h4-7,10H,3H2,1-2H3
charge 0 multiplicity 1
26 atoms
S  1.503103 -1.052805 0.282248
O  1.915531 -0.90686 1.846652
O  1.637469 -2.426905 -0.574607
N  2.576416 0.150579 -0.605675
C  -0.299697 -0.471977 0.135323
C  2.59374 1.531256 -0.065816
C  -0.814369 0.370571 1.134028
C  -1.059911 -0.931402 -0.952908
C  -2.965326 0.371156 -0.077173
C  -2.158235 0.789718 1.014172
C  -2.401206 -0.499836 -1.048062
C  3.776242 2.28902 -0.699326
C  -4.400321 0.84782 -0.206696
H  2.383575 0.058159 -1.61746
H  1.642852 2.081972 -0.244394
H  2.743572 1.446535 1.025005
H  -0.195368 0.655474 1.991204
H  -0.626579 -1.631025 -1.675609
H  -2.587286 1.441089 1.784322
H  -3.020099 -0.852627 -1.881196
H  4.721553 1.762207 -0.488873
H  3.663095 2.37638 -1.795861
H  3.835345 3.310533 -0.281558
H  -5.031215 0.101527 -0.71974
H  -4.849045 1.056823 0.779692
H  -4.452837 1.783417 -0.796692
