program: Orca
programVersion: 5.0.2
elementType: Br Br Cl Cl O O N N N N N C C C C C C C C C C C C C C C C C C C C C H H H H H H H H H H H H H H H H H
charge: 0
multiplicity: 1
keywords: wb97x-d3
keywords: def2-TZVPP
keywords: def2/J RIJCOSX
keywords: DEFGRID2
keywords: scfconv7
keywords: smallprint printgap noloewdin
keywords: NOSOSCF
formula: C21H17Br2Cl2N5O2
InChI: InChI=1/C21H17Br2Cl2N5O2/c1-10(11-4-5-11)27-20(31)13-7-12(24)8-14(22)18(13)28-21(32)16-9-17(23)29-30(16)19-15(25)3-2-6-26-19/h2-3,6-11,27-28H,4-5H2,1H3
49 atoms
Br -2.57782 2.657438 -1.842563
Br 3.069025 3.610093 3.069636
Cl -5.962944 -1.635733 -2.294921
Cl 2.642488 0.993472 -2.313054
O  -1.621758 -1.473794 1.944377
O  0.351872 -0.776039 -0.611438
N  -1.515895 -3.164465 0.43261
N  -1.13091 0.77579 0.10185
N  2.465753 0.623947 0.66335
N  3.244106 1.40641 1.399061
N  3.535522 -1.43271 0.666463
C  0.695554 -4.089555 0.757272
C  1.589767 -5.288564 0.779973
C  1.11511 -4.732998 -0.528246
C  -0.746946 -4.116809 1.22369
C  -1.427039 -5.476394 1.169322
C  -1.855173 -1.937245 0.837518
C  -2.623865 -1.138289 -0.179784
C  -2.265069 0.181033 -0.470287
C  -3.751484 -1.701475 -0.758686
C  -3.059974 0.904752 -1.358432
C  -4.539314 -0.942884 -1.607868
C  -4.207311 0.362737 -1.917144
C  0.105639 0.238893 0.012849
C  1.158311 0.984339 0.729605
C  1.098789 2.073954 1.567502
C  3.083011 -0.434523 -0.054983
C  2.42965 2.279273 1.942768
C  3.235458 -0.357762 -1.433513
C  3.876563 -1.398796 -2.080851
C  4.159036 -2.428438 0.050988
C  4.34666 -2.456935 -1.321128
H  1.184027 -3.146647 0.981477
H  2.625272 -5.13739 1.059199
H  1.18465 -6.240589 1.098727
H  0.385001 -5.310623 -1.083222
H  1.822004 -4.201753 -1.153659
H  -0.776142 -3.765612 2.255652
H  -1.448513 -5.892708 0.160136
H  -2.457924 -5.390342 1.51312
H  -0.925454 -6.191748 1.819795
H  -1.642424 -3.394005 -0.543213
H  -4.033177 -2.718732 -0.521013
H  -1.262777 1.62097 0.63846
H  -4.8263 0.939501 -2.590983
H  0.235228 2.636922 1.881982
H  4.011827 -1.38132 -3.153763
H  4.524128 -3.232668 0.677373
H  4.855054 -3.288349 -1.788804
elementType: Br Cl O N C H
totalener: -7303.65587290 hartree
nucrepener: 4824.27720439 hartree
twoeener: 7600.11055872 hartree
cpcmener: -0.04472566 hartree
kineticenergy: 7289.90665064 hartree
xcener: -301.141647469263 hartree
chargesum: -0.0000000
charge: -0.004033 0.003844 -0.068110 -0.051842 -0.498747 -0.459445 -0.159474 -0.154266 0.195972 -0.282707 -0.337971 -0.129932 -0.186474 -0.176980 0.192414 -0.310639 0.351751 -0.049778 0.182738 -0.146060 -0.143570 0.064684 -0.051721 0.376770 -0.065649 -0.166844 0.168045 0.008831 0.046738 -0.083560 -0.013823 -0.109725 0.086412 0.092509 0.088754 0.086831 0.086593 0.071527 0.098015 0.099211 0.095271 0.172492 0.133297 0.186498 0.124253 0.170783 0.150028 0.154390 0.162697
qa: -0.0040 0.0038 -0.0681 -0.0518 -0.4987 -0.4594 -0.1595 -0.1543 0.1960 -0.2827 -0.3380 -0.1299 -0.1865 -0.1770 0.1924 -0.3106 0.3518 -0.0498 0.1827 -0.1461 -0.1436 0.0647 -0.0517 0.3768 -0.0656 -0.1668 0.1680 0.0088 0.0467 -0.0836 -0.0138 -0.1097 0.0864 0.0925 0.0888 0.0868 0.0866 0.0715 0.0980 0.0992 0.0953 0.1725 0.1333 0.1865 0.1243 0.1708 0.1500 0.1544 0.1627
va: 1.2703 1.2349 1.2357 1.2678 2.0168 2.0439 3.2461 3.2512 3.3026 2.8679 3.0224 3.8400 3.9127 3.8934 3.7510 3.9546 4.1386 3.7597 3.6126 4.0553 4.1359 3.9312 3.8830 4.1384 3.9614 3.9292 3.9480 4.2541 3.9565 3.9742 3.9993 3.8409 1.0200 1.0209 1.0195 1.0188 1.0245 1.0376 1.0011 1.0077 1.0048 1.0113 1.0300 1.0024 1.0134 0.9913 1.0038 0.9961 0.9884
dispcorr: -0.033244774 hartree
energy: -7303.689117676532
dipole: 3.38233 -4.14956 -0.76723 -108.05298 106.16223 -1.89076 -4.24735 2.19244 -2.05491
magnitude: 2.89590 au
magnitude: 7.36079 debye
