program: Orca
programVersion: 5.0.2
elementType: Br Br Cl Cl O O N N N N N C C C C C C C C C C C C C C C C C C C C C H H H H H H H H H H H H H H H H H
charge: 0
multiplicity: 1
keywords: wb97x-d3
keywords: def2-TZVPP
keywords: def2/J RIJCOSX
keywords: DEFGRID2
keywords: scfconv7
keywords: smallprint printgap noloewdin
keywords: NOSOSCF
formula: C21H17Br2Cl2N5O2
InChI: InChI=1/C21H17Br2Cl2N5O2/c1-10(11-4-5-11)27-20(31)13-7-12(24)8-14(22)18(13)28-21(32)16-9-17(23)29-30(16)19-15(25)3-2-6-26-19/h2-3,6-11,27-28H,4-5H2,1H3
49 atoms
Br -2.664528 2.610527 -0.021521
Br 3.230516 1.231854 4.239753
Cl -6.201872 -0.812304 -2.436118
Cl 3.656364 3.299259 -0.667527
O  -1.594199 -2.785702 1.083194
O  -0.018025 0.953659 -1.161768
N  -1.801406 -3.629051 -1.010165
N  -1.154211 -0.033723 0.537261
N  2.355426 0.83543 0.479959
N  3.208391 1.018863 1.48162
N  2.700101 -0.461852 -1.411109
C  0.319057 -4.865516 -1.255436
C  0.719957 -4.192052 -2.531344
C  1.162732 -3.634221 -1.210709
C  -1.123399 -4.892623 -0.786044
C  -1.898345 -6.009629 -1.46925
C  -1.993651 -2.697792 -0.070646
C  -2.780817 -1.500374 -0.519053
C  -2.350774 -0.215584 -0.172906
C  -3.968021 -1.684691 -1.213158
C  -3.142292 0.871679 -0.541854
C  -4.722325 -0.58312 -1.577303
C  -4.322116 0.699699 -1.250326
C  -0.063834 0.54542 -0.019872
C  1.078685 0.677919 0.909461
C  1.112183 0.782437 2.27946
C  2.8663 0.706214 -0.833288
C  2.467747 0.995601 2.56259
C  3.525688 1.769453 -1.437821
C  4.056317 1.572871 -2.702305
C  3.185327 -0.644344 -2.629884
C  3.882372 0.341958 -3.309764
H  0.835216 -5.79473 -1.035353
H  1.453394 -4.682421 -3.159024
H  -0.028099 -3.636393 -3.085349
H  0.71733 -2.702183 -0.886017
H  2.202077 -3.743764 -0.927963
H  -1.12944 -5.071953 0.29013
H  -1.952206 -5.853991 -2.548977
H  -2.915513 -6.079962 -1.082177
H  -1.409122 -6.968822 -1.298161
H  -2.117486 -3.436402 -1.949831
H  -4.309693 -2.681539 -1.459057
H  -1.045174 -0.560815 1.393034
H  -4.932216 1.54804 -1.529925
H  0.285011 0.744574 2.969299
H  4.583515 2.371624 -3.206121
H  3.01761 -1.615893 -3.077963
H  4.27927 0.153611 -4.297389
elementType: Br Cl O N C H
totalener: -7303.65863514 hartree
nucrepener: 4779.80233939 hartree
twoeener: 7555.97101433 hartree
cpcmener: -0.04223777 hartree
kineticenergy: 7289.91040922 hartree
xcener: -301.139688085612 hartree
chargesum: -0.0000000
charge: -0.001767 0.002055 -0.068499 -0.048773 -0.512731 -0.442098 -0.180770 -0.154466 0.183322 -0.291320 -0.341100 -0.091857 -0.175311 -0.192217 0.143192 -0.288669 0.369116 -0.046764 0.146955 -0.142374 -0.103724 0.068452 -0.054552 0.280151 0.014512 -0.184178 0.201983 0.010244 0.002001 -0.086285 0.044708 -0.126084 0.087212 0.094262 0.078844 0.080384 0.097283 0.072224 0.093954 0.100955 0.092257 0.178567 0.136108 0.196416 0.124689 0.178380 0.147960 0.144278 0.163077
qa: -0.0018 0.0021 -0.0685 -0.0488 -0.5127 -0.4421 -0.1808 -0.1545 0.1833 -0.2913 -0.3411 -0.0919 -0.1753 -0.1922 0.1432 -0.2887 0.3691 -0.0468 0.1470 -0.1424 -0.1037 0.0685 -0.0546 0.2802 0.0145 -0.1842 0.2020 0.0102 0.0020 -0.0863 0.0447 -0.1261 0.0872 0.0943 0.0788 0.0804 0.0973 0.0722 0.0940 0.1010 0.0923 0.1786 0.1361 0.1964 0.1247 0.1784 0.1480 0.1443 0.1631
va: 1.2623 1.2343 1.2355 1.2666 1.9881 2.0554 3.2116 3.1679 3.3320 2.8253 3.0680 3.8774 3.8961 3.9047 3.8253 3.9503 4.1202 3.7360 3.6822 4.0017 4.1465 3.9208 3.9196 4.2045 3.8597 3.9142 3.9052 4.2365 4.0127 3.9710 3.9633 3.9268 1.0157 1.0199 1.0205 1.0145 1.0203 1.0316 1.0021 1.0074 1.0059 1.0037 1.0283 1.0187 1.0134 0.9926 1.0040 0.9910 0.9891
dispcorr: -0.031086132 hartree
energy: -7303.689721275855
dipole: -4.34542 3.51497 -0.83045 -83.90562 81.85181 -2.05381 -58.45621 55.99472 -2.46149
magnitude: 3.31160 au
magnitude: 8.41743 debye
