program: Orca
programVersion: 5.0.2
elementType: Br Br Cl Cl O O N N N N N C C C C C C C C C C C C C C C C C C C C C H H H H H H H H H H H H H H H H H
charge: 0
multiplicity: 1
keywords: wb97x-d3
keywords: def2-TZVPP
keywords: def2/J RIJCOSX
keywords: DEFGRID2
keywords: scfconv7
keywords: smallprint printgap noloewdin
keywords: NOSOSCF
formula: C21H17Br2Cl2N5O2
InChI: InChI=1/C21H17Br2Cl2N5O2/c1-10(11-4-5-11)27-20(31)13-7-12(24)8-14(22)18(13)28-21(32)16-9-17(23)29-30(16)19-15(25)3-2-6-26-19/h2-3,6-11,27-28H,4-5H2,1H3
49 atoms
Br -3.530241 1.887043 1.936806
Br 4.661962 0.348859 3.468471
Cl -6.074365 -1.056101 -1.944255
Cl 3.626943 0.370591 -1.552495
O  -0.085714 -0.339408 -1.973075
O  -0.424827 -1.515682 1.30964
N  -0.766343 -2.481567 -1.676094
N  -1.046862 0.572806 0.687231
N  1.921547 1.110517 0.823238
N  3.128076 1.283148 1.360388
N  0.628774 2.640055 -0.358818
C  0.151123 -4.522774 -2.570316
C  -0.537927 -4.768541 -3.874697
C  0.908199 -5.12294 -3.711805
C  0.46139 -3.112399 -2.139459
C  1.559085 -3.078774 -1.082871
C  -0.907401 -1.148618 -1.58739
C  -2.222198 -0.701217 -1.009533
C  -2.240029 0.192077 0.063594
C  -3.402342 -1.102912 -1.61218
C  -3.466219 0.689577 0.492708
C  -4.608206 -0.581349 -1.170804
C  -4.652981 0.323997 -0.127031
C  -0.158819 -0.34578 1.144572
C  1.192821 0.163151 1.482914
C  1.986544 -0.287694 2.504668
C  1.632714 1.789955 -0.382377
C  3.166248 0.457666 2.3752
C  2.390504 1.55102 -1.52398
C  2.085649 2.266867 -2.668395
C  0.322602 3.308681 -1.459454
C  1.037281 3.167426 -2.635883
H  -0.093011 -5.199016 -1.754506
H  -1.260168 -5.571838 -3.93646
H  -0.785942 -3.906676 -4.481767
H  1.643549 -4.504823 -4.212208
H  1.18069 -6.168262 -3.656183
H  0.79479 -2.54405 -3.011994
H  1.832872 -2.057109 -0.827357
H  2.450531 -3.583268 -1.45654
H  1.240221 -3.579924 -0.168725
H  -1.394898 -3.047175 -1.127619
H  -3.380913 -1.791652 -2.446083
H  -0.75278 1.542504 0.614959
H  -5.598655 0.725867 0.207733
H  1.741585 -1.04009 3.233522
H  2.652568 2.102678 -3.573968
H  -0.521599 3.983273 -1.394402
H  0.767955 3.735963 -3.514468
totalener: -7303.61873606 hartree
nucrepener: 4873.82751141 hartree
twoeener: 7648.82173833 hartree
kineticenergy: 7290.01030333 hartree
xcener: -301.153141227275 hartree
chargesum: 0.0000000
charge: 0.004101 0.007063 -0.059274 -0.034912 -0.420162 -0.373925 -0.148791 -0.210379 0.169464 -0.279561 -0.344763 -0.067824 -0.135621 -0.161155 0.081921 -0.233139 0.330333 -0.058297 0.228123 -0.155606 -0.169484 0.068901 -0.062729 0.269899 -0.014589 -0.168785 0.189989 0.031452 0.075589 -0.086514 0.010189 -0.074048 0.084154 0.080126 0.066769 0.069454 0.079862 0.048806 0.056725 0.094295 0.088192 0.147308 0.128711 0.193190 0.116728 0.161005 0.121611 0.124328 0.131271
qa: 0.0041 0.0071 -0.0593 -0.0349 -0.4202 -0.3739 -0.1488 -0.2104 0.1695 -0.2796 -0.3448 -0.0678 -0.1356 -0.1612 0.0819 -0.2331 0.3303 -0.0583 0.2281 -0.1556 -0.1695 0.0689 -0.0627 0.2699 -0.0146 -0.1688 0.1900 0.0315 0.0756 -0.0865 0.0102 -0.0740 0.0842 0.0801 0.0668 0.0695 0.0799 0.0488 0.0567 0.0943 0.0882 0.1473 0.1287 0.1932 0.1167 0.1610 0.1216 0.1243 0.1313
va: 1.2737 1.2353 1.2462 1.2776 2.1007 2.1323 3.2191 3.1690 3.2983 2.8030 3.0759 3.8150 3.9099 3.9706 3.9136 3.9320 4.1063 3.7779 3.6053 4.0406 4.1756 3.9508 3.8877 4.2624 3.8098 3.9164 3.8975 4.1864 4.0037 4.0315 4.0340 3.9049 1.0115 1.0207 1.0252 1.0210 1.0217 1.0313 1.0298 1.0087 1.0177 1.0315 1.0305 1.0479 1.0176 1.0022 1.0137 1.0008 0.9976
dispcorr: -0.034964705 hartree
energy: -7303.653700760156
dipole: -6.84247 6.10353 -0.73894 -48.78411 48.65669 -0.12742 -74.68223 73.04963 -1.63260
magnitude: 1.79656 au
magnitude: 4.56650 debye
