program: Orca
programVersion: 5.0.2
elementType: Br Br Cl Cl O O N N N N N C C C C C C C C C C C C C C C C C C C C C H H H H H H H H H H H H H H H H H
charge: 0
multiplicity: 1
keywords: wb97x-d3
keywords: def2-TZVPP
keywords: def2/J RIJCOSX
keywords: DEFGRID2
keywords: scfconv7
keywords: smallprint printgap noloewdin
keywords: NOSOSCF
formula: C21H17Br2Cl2N5O2
InChI: InChI=1/C21H17Br2Cl2N5O2/c1-10(11-4-5-11)27-20(31)13-7-12(24)8-14(22)18(13)28-21(32)16-9-17(23)29-30(16)19-15(25)3-2-6-26-19/h2-3,6-11,27-28H,4-5H2,1H3
49 atoms
Br -3.543533 2.109922 1.861268
Br 4.620821 0.189936 3.35517
Cl -6.297203 -1.101245 -1.645008
Cl 3.422534 -0.451094 -1.598949
O  -0.336179 -0.550927 -2.02115
O  -0.693599 -1.386093 1.607755
N  -0.934414 -2.602233 -1.249899
N  -1.130654 0.615786 0.642956
N  1.899262 0.847301 0.662803
N  3.135171 0.954415 1.146485
N  0.748997 2.316596 -0.723305
C  0.283011 -4.006129 -2.850427
C  0.459824 -3.247539 -4.126271
C  1.55035 -4.14952 -3.634752
C  0.326876 -3.274467 -1.532554
C  0.675983 -4.198414 -0.375341
C  -1.117457 -1.287216 -1.449982
C  -2.408169 -0.751369 -0.895786
C  -2.364241 0.229909 0.095867
C  -3.615302 -1.177192 -1.420886
C  -3.56034 0.794909 0.523566
C  -4.791438 -0.591311 -0.979125
C  -4.777195 0.401301 -0.016424
C  -0.32148 -0.291801 1.245369
C  1.084698 0.119973 1.481367
C  1.85335 -0.251256 2.553763
C  1.652962 1.365255 -0.629114
C  3.109173 0.309376 2.285317
C  2.350359 0.87731 -1.729036
C  2.112846 1.459852 -2.961188
C  0.497916 2.85146 -1.907459
C  1.175184 2.471305 -3.052775
H  -0.400274 -4.850669 -2.874795
H  -0.11089 -3.559669 -4.990861
H  0.610278 -2.178162 -4.055815
H  2.446255 -3.687643 -3.236434
H  1.73295 -5.078054 -4.159108
H  1.09248 -2.49625 -1.597899
H  -0.059268 -4.99956 -0.266974
H  0.723948 -3.648181 0.564057
H  1.643186 -4.667786 -0.54985
H  -1.563815 -3.052833 -0.604443
H  -3.63966 -1.938247 -2.189346
H  -0.749477 1.524596 0.396895
H  -5.701779 0.849973 0.317577
H  1.545348 -0.839648 3.400075
H  2.639869 1.106159 -3.836278
H  -0.266318 3.617554 -1.937469
H  0.958033 2.940744 -4.001392
totalener: -7303.61819096 hartree
nucrepener: 4910.34588321 hartree
twoeener: 7685.13569167 hartree
kineticenergy: 7290.00884873 hartree
xcener: -301.152300717231 hartree
chargesum: 0.0000000
charge: 0.008341 0.008112 -0.057946 -0.042679 -0.429722 -0.381523 -0.166973 -0.225566 0.162993 -0.282114 -0.349333 -0.041938 -0.136718 -0.156578 0.094671 -0.264756 0.364093 -0.051944 0.210345 -0.162953 -0.155631 0.083458 -0.077617 0.274649 0.012961 -0.185745 0.200602 0.035713 0.062668 -0.087345 0.016774 -0.069195 0.067210 0.074224 0.070999 0.065114 0.078190 0.018839 0.078073 0.117129 0.089260 0.151127 0.126165 0.198912 0.116309 0.162614 0.122286 0.123053 0.131392
qa: 0.0083 0.0081 -0.0579 -0.0427 -0.4297 -0.3815 -0.1670 -0.2256 0.1630 -0.2821 -0.3493 -0.0419 -0.1367 -0.1566 0.0947 -0.2648 0.3641 -0.0519 0.2103 -0.1630 -0.1556 0.0835 -0.0776 0.2746 0.0130 -0.1857 0.2006 0.0357 0.0627 -0.0873 0.0168 -0.0692 0.0672 0.0742 0.0710 0.0651 0.0782 0.0188 0.0781 0.1171 0.0893 0.1511 0.1262 0.1989 0.1163 0.1626 0.1223 0.1231 0.1314
va: 1.2773 1.2361 1.2473 1.2708 2.0943 2.1227 3.2057 3.1693 3.3102 2.8020 3.0768 3.7927 3.9169 3.9436 3.9306 3.9451 4.0751 3.8008 3.6147 4.0456 4.1866 3.9393 3.9075 4.2506 3.8184 3.9259 3.8958 4.1858 3.9930 4.0076 4.0352 3.9052 1.0208 1.0214 1.0360 1.0238 1.0218 1.0526 1.0046 1.0155 1.0060 1.0278 1.0308 1.0431 1.0182 1.0024 1.0131 1.0008 0.9972
dispcorr: -0.035794151 hartree
energy: -7303.653985112078
dipole: -5.72323 5.06281 -0.66042 -48.78364 48.63223 -0.15141 -71.53223 70.02008 -1.51215
magnitude: 1.65701 au
magnitude: 4.21178 debye
