program: Orca
programVersion: 5.0.2
elementType: Br Cl O O N N N N N N C C C C C C C C C C C C C C C C C C C H H H H H H H H H H H H H H
charge: 0
multiplicity: 1
keywords: wb97x-d3
keywords: def2-TZVPP
keywords: def2/J RIJCOSX
keywords: DEFGRID2
keywords: scfconv7
keywords: smallprint printgap noloewdin
keywords: NOSOSCF
formula: C19H14BrClN6O2
InChI: InChI=1/C19H14BrClN6O2/c1-10-6-11(9-22)7-12(18(28)23-2)16(10)25-19(29)14-8-15(20)26-27(14)17-13(21)4-3-5-24-17/h3-8,23,25H,1-2H3
43 atoms
Br 4.021922 3.069529 0.969975
Cl -1.112865 0.724422 3.10887
O  -0.643334 -1.101635 0.213023
O  0.419898 -1.322309 -2.690968
N  -0.971679 0.719848 -1.095882
N  1.432874 0.244987 1.585528
N  2.515918 0.943189 1.906411
N  -0.801849 -3.150163 -2.200957
N  1.819415 -1.850048 2.505355
N  -6.131409 -1.630682 -4.750377
C  -2.022813 0.206238 -1.866681
C  -3.169561 0.997144 -2.013149
C  -1.93312 -1.052095 -2.475259
C  0.841654 0.701193 0.452266
C  -4.219351 0.510554 -2.77593
C  -0.322186 0.01996 -0.141189
C  -3.003612 -1.527257 -3.215673
C  -4.143782 -0.746679 -3.365848
C  -3.27372 2.336066 -1.350509
C  -0.66319 -1.847939 -2.450557
C  1.603631 1.756336 0.0102
C  1.026513 -0.804472 2.450209
C  2.625663 1.846599 0.960757
C  -0.123285 -0.67758 3.218437
C  -0.4612 -1.711172 4.073798
C  -5.239379 -1.237253 -4.133364
C  1.500706 -2.839345 3.33021
C  0.370036 -2.816714 4.128399
C  0.337166 -4.03252 -2.101399
H  -0.766232 1.705211 -1.198045
H  -5.111593 1.110477 -2.898019
H  -2.948791 -2.490527 -3.704673
H  -3.128661 2.26123 -0.271965
H  -2.527363 3.037256 -1.730396
H  -4.25274 2.77642 -1.527315
H  1.46225 2.353879 -0.875326
H  -1.705014 -3.502265 -1.925386
H  -1.349565 -1.65122 4.687055
H  2.174314 -3.685674 3.352096
H  0.142942 -3.645861 4.782874
H  0.995588 -3.74702 -1.281797
H  0.914609 -4.044071 -3.022926
H  -0.023902 -5.038255 -1.915605
elementType: Br Cl O N C H
totalener: -4245.96586623 hartree
nucrepener: 3342.78141202 hartree
electener: -7588.74727825 hartree
twoeener: 4929.95757558 hartree
cpcmener: -0.06977085 hartree
kineticenergy: 4236.70869136 hartree
xcener: -206.769031673464 hartree
chargesum: 0.0000000
charge: 0.004796 -0.053535 -0.483966 -0.543576 -0.113359 0.193562 -0.290957 -0.162229 -0.345594 -0.124696 0.136697 -0.050862 0.002935 -0.053800 -0.127449 0.384715 -0.180801 0.203073 -0.254223 0.330449 -0.194299 0.171026 0.009245 0.031953 -0.087932 -0.127038 0.015405 -0.112578 -0.165836 0.198821 0.141936 0.142049 0.116520 0.112822 0.100439 0.180442 0.190695 0.152064 0.152638 0.167785 0.106410 0.109487 0.116764
qa: 0.0048 -0.0535 -0.4840 -0.5436 -0.1134 0.1936 -0.2910 -0.1622 -0.3456 -0.1247 0.1367 -0.0509 0.0029 -0.0538 -0.1274 0.3847 -0.1808 0.2031 -0.2542 0.3304 -0.1943 0.1710 0.0092 0.0320 -0.0879 -0.1270 0.0154 -0.1126 -0.1658 0.1988 0.1419 0.1420 0.1165 0.1128 0.1004 0.1804 0.1907 0.1521 0.1526 0.1678 0.1064 0.1095 0.1168
va: 1.2369 1.2662 2.0075 1.9682 3.2740 3.2901 2.8647 3.2234 3.0480 3.1276 3.8048 3.8747 3.7619 3.9313 3.9621 4.1045 4.0739 3.6795 3.9085 4.1481 3.9618 3.9755 4.2562 3.9627 3.9791 4.0199 4.0143 3.8783 3.9052 0.9887 1.0115 1.0283 0.9977 0.9928 1.0047 0.9894 0.9964 1.0036 0.9960 0.9863 0.9941 0.9944 0.9982
dispcorr: -0.024471350 hartree
energy: -4245.990337582617
dipole: -50.93083 49.30276 -1.62808 -43.30449 43.27477 -0.02971 -20.42379 22.09589 1.67209
magnitude: 2.33397 au
magnitude: 5.93247 debye
