program: Orca
programVersion: 5.0.2
elementType: Br Cl O O N N N N N N C C C C C C C C C C C C C C C C C C C H H H H H H H H H H H H H H
charge: 0
multiplicity: 1
keywords: wb97x-d3
keywords: def2-TZVPP
keywords: def2/J RIJCOSX
keywords: DEFGRID2
keywords: scfconv7
keywords: smallprint printgap noloewdin
keywords: NOSOSCF
formula: C19H14BrClN6O2
InChI: InChI=1/C19H14BrClN6O2/c1-10-6-11(9-22)7-12(18(28)23-2)16(10)25-19(29)14-8-15(20)26-27(14)17-13(21)4-3-5-24-17/h3-8,23,25H,1-2H3
43 atoms
Br 4.035515 3.059341 1.06542
Cl -1.342319 0.815568 2.790518
O  -0.408217 -1.261616 0.092052
O  0.588964 -1.070879 -2.890456
N  -0.928747 0.634207 -1.041575
N  1.406991 0.270969 1.678554
N  2.462934 0.996307 2.033561
N  -0.423474 -3.05532 -2.557793
N  1.696825 -1.712296 2.848916
N  -5.98574 -1.859414 -4.743615
C  -1.960174 0.098391 -1.825859
C  -3.190345 0.766935 -1.833109
C  -1.769249 -1.07046 -2.57221
C  0.901762 0.649768 0.478381
C  -4.219618 0.252454 -2.606106
C  -0.202096 -0.087227 -0.164656
C  -2.818584 -1.578961 -3.32059
C  -4.040152 -0.915733 -3.339005
C  -3.403391 2.001037 -1.011874
C  -0.425363 -1.726812 -2.672334
C  1.690336 1.676985 0.0233
C  0.902851 -0.700959 2.578288
C  2.641292 1.834013 1.039799
C  -0.353388 -0.546043 3.151957
C  -0.800708 -1.516091 4.031226
C  -5.114085 -1.438122 -4.11606
C  1.275237 -2.63554 3.702858
C  0.03255 -2.584736 4.311074
C  0.801008 -3.820982 -2.593989
H  -0.805765 1.638816 -1.054648
H  -5.176226 0.757937 -2.623983
H  -2.686688 -2.47287 -3.915016
H  -4.431659 2.346422 -1.095225
H  -3.194506 1.816457 0.042999
H  -2.755269 2.81943 -1.332151
H  1.612973 2.209304 -0.910333
H  -1.272796 -3.524119 -2.284873
H  -1.774164 -1.432907 4.494581
H  1.956519 -3.451173 3.905425
H  -0.277169 -3.362419 4.994224
H  0.548239 -4.875376 -2.546982
H  1.448689 -3.583943 -1.749123
H  1.353502 -3.644044 -3.514914
elementType: Br Cl O N C H
totalener: -4245.96584707 hartree
nucrepener: 3347.33683018 hartree
electener: -7593.30267724 hartree
twoeener: 4934.32773457 hartree
cpcmener: -0.06923165 hartree
kineticenergy: 4236.70663554 hartree
xcener: -206.768059335356 hartree
chargesum: 0.0000000
charge: 0.004482 -0.054389 -0.478506 -0.543355 -0.106220 0.192769 -0.294060 -0.163302 -0.342353 -0.123504 0.141720 -0.051135 0.003144 -0.012771 -0.126514 0.329218 -0.180593 0.205988 -0.252175 0.332118 -0.214235 0.172910 0.011461 0.033411 -0.085641 -0.128028 0.015859 -0.116072 -0.167608 0.201062 0.141784 0.142142 0.100744 0.112921 0.113845 0.183795 0.190501 0.154342 0.153068 0.167550 0.117365 0.109767 0.108496
qa: 0.0045 -0.0544 -0.4785 -0.5434 -0.1062 0.1928 -0.2941 -0.1633 -0.3424 -0.1235 0.1417 -0.0511 0.0031 -0.0128 -0.1265 0.3292 -0.1806 0.2060 -0.2522 0.3321 -0.2142 0.1729 0.0115 0.0334 -0.0856 -0.1280 0.0159 -0.1161 -0.1676 0.2011 0.1418 0.1421 0.1007 0.1129 0.1138 0.1838 0.1905 0.1543 0.1531 0.1675 0.1174 0.1098 0.1085
va: 1.2369 1.2689 2.0063 1.9669 3.2557 3.2854 2.8663 3.2245 3.0592 3.1279 3.7884 3.8788 3.7571 3.8798 3.9660 4.1502 4.0723 3.6781 3.9114 4.1414 3.9754 3.9866 4.2505 3.9533 3.9732 4.0195 4.0183 3.8848 3.9041 0.9881 1.0113 1.0285 1.0051 0.9972 0.9925 0.9900 0.9965 1.0027 0.9959 0.9865 0.9981 0.9923 0.9951
dispcorr: -0.024792103 hartree
energy: -4245.990639168996
dipole: -50.15511 48.31325 -1.84186 -43.50891 43.39169 -0.11721 -20.94947 22.63278 1.68331
magnitude: 2.49794 au
magnitude: 6.34927 debye
