program: Orca
programVersion: 5.0.2
elementType: Br Cl O O N N N N N N C C C C C C C C C C C C C C C C C C C H H H H H H H H H H H H H H
charge: 0
multiplicity: 1
keywords: wb97x-d3
keywords: def2-TZVPP
keywords: def2/J RIJCOSX
keywords: DEFGRID2
keywords: scfconv7
keywords: smallprint printgap noloewdin
keywords: NOSOSCF
formula: C19H14BrClN6O2
InChI: InChI=1/C19H14BrClN6O2/c1-10-6-11(9-22)7-12(18(28)23-2)16(10)25-19(29)14-8-15(20)26-27(14)17-13(21)4-3-5-24-17/h3-8,23,25H,1-2H3
43 atoms
Br 3.905793 3.246885 1.069107
Cl -0.190955 0.238593 3.801948
O  -0.960269 -0.740001 0.413282
O  0.166404 -1.646192 -2.360193
N  -0.960857 0.821664 -1.225685
N  1.515124 0.203912 1.358256
N  2.600677 0.885091 1.697542
N  -1.330221 -3.147432 -1.556723
N  1.875346 -2.091681 1.387051
N  -6.20741 -1.396277 -4.836957
C  -2.04834 0.326171 -1.958542
C  -3.054293 1.228599 -2.324473
C  -2.119067 -1.022244 -2.328791
C  0.786952 0.829007 0.400546
C  -4.120669 0.764425 -3.078948
C  -0.454197 0.227827 -0.123586
C  -3.204861 -1.469237 -3.064121
C  -4.200921 -0.575636 -3.442819
C  -2.987064 2.664889 -1.906046
C  -0.978006 -1.963014 -2.067945
C  1.451702 1.998143 0.108733
C  1.29703 -1.064202 1.961521
C  2.56539 1.965916 0.953384
C  0.531923 -1.159162 3.115286
C  0.355775 -2.408592 3.68315
C  -5.307347 -1.035124 -4.215988
C  1.71393 -3.29057 1.930892
C  0.959706 -3.496247 3.074717
C  -0.388369 -4.170232 -1.171865
H  -0.539978 1.678177 -1.558264
H  -4.903593 1.450627 -3.374712
H  -3.265443 -2.503692 -3.375784
H  -2.140188 3.182694 -2.362373
H  -3.889537 3.196563 -2.20171
H  -2.879449 2.760938 -0.824432
H  1.180068 2.767071 -0.596013
H  -2.283653 -3.267776 -1.251488
H  -0.239632 -2.530735 4.577701
H  2.20405 -4.118703 1.434822
H  0.846459 -4.489822 3.485437
H  0.587824 -3.962577 -1.600178
H  -0.722274 -5.142626 -1.531966
H  -0.287607 -4.220309 -0.086584
elementType: Br Cl O N C H
totalener: -4245.96694329 hartree
nucrepener: 3352.10890897 hartree
electener: -7598.07585226 hartree
twoeener: 4939.15081818 hartree
cpcmener: -0.05760589 hartree
kineticenergy: 4236.71750796 hartree
xcener: -206.767693736405 hartree
chargesum: 0.0000000
charge: 0.003137 -0.050875 -0.461927 -0.498261 -0.131647 0.185210 -0.278952 -0.158373 -0.318990 -0.108018 0.166627 -0.077415 -0.022733 -0.049321 -0.116912 0.370113 -0.177565 0.197081 -0.252089 0.292496 -0.155050 0.152617 0.000946 0.037556 -0.096397 -0.138315 -0.025804 -0.082295 -0.162568 0.189587 0.139267 0.143003 0.110808 0.098572 0.116363 0.173110 0.180425 0.148919 0.155260 0.163369 0.106807 0.120592 0.111643
qa: 0.0031 -0.0509 -0.4619 -0.4983 -0.1316 0.1852 -0.2790 -0.1584 -0.3190 -0.1080 0.1666 -0.0774 -0.0227 -0.0493 -0.1169 0.3701 -0.1776 0.1971 -0.2521 0.2925 -0.1550 0.1526 0.0009 0.0376 -0.0964 -0.1383 -0.0258 -0.0823 -0.1626 0.1896 0.1393 0.1430 0.1108 0.0986 0.1164 0.1731 0.1804 0.1489 0.1553 0.1634 0.1068 0.1206 0.1116
va: 1.2352 1.2686 2.0479 2.0248 3.2750 3.3008 2.8500 3.2141 3.0550 3.1292 3.7781 3.8913 3.7372 3.9564 3.9596 4.1287 4.0654 3.6907 3.9142 4.2147 3.8923 3.9743 4.2598 3.9902 3.9892 4.0185 4.0129 3.8453 3.8730 0.9960 1.0122 1.0267 0.9941 1.0046 0.9968 0.9904 1.0006 1.0051 0.9935 0.9872 1.0201 0.9963 0.9913
dispcorr: -0.025773184 hartree
energy: -4245.992716477813
dipole: -51.41415 50.36424 -1.04991 -44.83429 44.62616 -0.20813 -23.82105 25.14037 1.31932
magnitude: 1.69889 au
magnitude: 4.31823 debye
