program: Orca
programVersion: 5.0.2
elementType: Br Cl O O N N N N N N C C C C C C C C C C C C C C C C C C C H H H H H H H H H H H H H H
charge: 0
multiplicity: 1
keywords: wb97x-d3
keywords: def2-TZVPP
keywords: def2/J RIJCOSX
keywords: DEFGRID2
keywords: scfconv7
keywords: smallprint printgap noloewdin
keywords: NOSOSCF
formula: C19H14BrClN6O2
InChI: InChI=1/C19H14BrClN6O2/c1-10-6-11(9-22)7-12(18(28)23-2)16(10)25-19(29)14-8-15(20)26-27(14)17-13(21)4-3-5-24-17/h3-8,23,25H,1-2H3
43 atoms
Br 3.938943 3.192808 0.826048
Cl 3.450639 -1.942432 2.064473
O  -0.203433 -1.160609 -0.710106
O  -3.029226 -1.062778 0.615859
N  -1.244993 0.848212 -0.950399
N  1.459415 0.241627 1.285442
N  2.511795 0.969738 1.652081
N  -2.72958 -2.867877 -0.710595
N  -0.295177 -0.718785 2.423895
N  -5.908779 -0.82197 -5.531696
C  -2.248585 0.482879 -1.858611
C  -2.492844 1.355563 -2.929648
C  -2.971966 -0.707035 -1.725016
C  0.838606 0.747019 0.19073
C  -3.456898 1.011208 -3.862847
C  -0.256816 0.036071 -0.51252
C  -3.912187 -1.044177 -2.686777
C  -4.154167 -0.187652 -3.75378
C  -1.718684 2.629117 -3.08075
C  -2.88485 -1.557969 -0.492681
C  1.55125 1.855114 -0.189706
C  0.980875 -0.792775 2.117378
C  2.580996 1.926523 0.762231
C  1.811556 -1.815664 2.562547
C  1.264041 -2.775307 3.398862
C  -5.128129 -0.537505 -4.734215
C  -0.827073 -1.654628 3.194999
C  -0.078971 -2.693514 3.723616
C  -2.566527 -3.81104 0.368799
H  -1.163501 1.831281 -0.728986
H  -3.654719 1.675101 -4.694297
H  -4.483739 -1.958057 -2.592994
H  -1.898082 3.318141 -2.251827
H  -0.643909 2.443109 -3.123288
H  -2.002123 3.147089 -3.994945
H  1.383087 2.489994 -1.043803
H  -2.462693 -3.166982 -1.635539
H  1.875423 -3.584517 3.775015
H  -1.884818 -1.565603 3.407459
H  -0.53729 -3.429998 4.36856
H  -3.359541 -3.705316 1.10652
H  -1.605137 -3.693882 0.873571
H  -2.617225 -4.816693 -0.039642
elementType: Br Cl O N C H
totalener: -4245.96677777 hartree
nucrepener: 3333.54704265 hartree
electener: -7579.51382042 hartree
twoeener: 4920.50261607 hartree
cpcmener: -0.05452574 hartree
kineticenergy: 4236.71527237 hartree
xcener: -206.765989499250 hartree
chargesum: -0.0000000
charge: 0.002393 -0.049141 -0.450795 -0.501088 -0.147765 0.167568 -0.292680 -0.167435 -0.333822 -0.109259 0.155145 -0.052618 0.001924 0.005577 -0.132692 0.330288 -0.173901 0.196999 -0.261687 0.301985 -0.189920 0.241903 0.012696 -0.007972 -0.082427 -0.136060 -0.005038 -0.114781 -0.170227 0.190291 0.139214 0.142491 0.113207 0.116883 0.101277 0.187197 0.182313 0.148271 0.146720 0.163817 0.108483 0.101695 0.120968
qa: 0.0024 -0.0491 -0.4508 -0.5011 -0.1478 0.1676 -0.2927 -0.1674 -0.3338 -0.1093 0.1551 -0.0526 0.0019 0.0056 -0.1327 0.3303 -0.1739 0.1970 -0.2617 0.3020 -0.1899 0.2419 0.0127 -0.0080 -0.0824 -0.1361 -0.0050 -0.1148 -0.1702 0.1903 0.1392 0.1425 0.1132 0.1169 0.1013 0.1872 0.1823 0.1483 0.1467 0.1638 0.1085 0.1017 0.1210
va: 1.2350 1.2635 2.0528 2.0238 3.2684 3.3285 2.8375 3.1944 3.0429 3.1268 3.7926 3.8710 3.7216 3.8592 3.9700 4.1978 4.0602 3.6938 3.9141 4.1680 3.8828 3.8829 4.2447 4.0013 3.9568 4.0169 3.9969 3.8621 3.9083 0.9999 1.0126 1.0278 0.9924 0.9949 1.0051 0.9840 1.0024 1.0044 1.0048 0.9880 0.9980 0.9895 0.9998
dispcorr: -0.026087452 hartree
energy: -4245.992865219349
dipole: -62.86589 63.26784 0.40195 -37.50690 37.21142 -0.29548 -16.57238 16.81326 0.24088
magnitude: 0.55399 au
magnitude: 1.40812 debye
