program: Orca
programVersion: 5.0.2
elementType: Br Cl O O N N N N N N C C C C C C C C C C C C C C C C C C C H H H H H H H H H H H H H H
charge: 0
multiplicity: 1
keywords: wb97x-d3
keywords: def2-TZVPP
keywords: def2/J RIJCOSX
keywords: DEFGRID2
keywords: scfconv7
keywords: smallprint printgap noloewdin
keywords: NOSOSCF
formula: C19H14BrClN6O2
InChI: InChI=1/C19H14BrClN6O2/c1-10-6-11(9-22)7-12(18(28)23-2)16(10)25-19(29)14-8-15(20)26-27(14)17-13(21)4-3-5-24-17/h3-8,23,25H,1-2H3
43 atoms
Br 2.972099 3.836734 2.06743
Cl -0.348609 -0.472162 3.032434
O  0.442409 -0.929152 -1.131651
O  -2.016794 -1.863304 0.39758
N  -1.116863 0.705839 -0.875492
N  1.797974 0.259069 1.126629
N  2.529775 1.112825 1.834982
N  -1.527495 -3.278543 -1.293833
N  2.71796 -1.88487 0.994193
N  -5.728429 -1.4331 -5.308348
C  -2.081677 0.229813 -1.772432
C  -2.679402 1.164633 -2.630299
C  -2.439103 -1.123007 -1.81951
C  0.960074 0.887418 0.267124
C  -3.632018 0.723643 -3.534342
C  0.080913 0.124683 -0.645279
C  -3.375552 -1.544339 -2.750733
C  -3.970837 -0.623718 -3.605512
C  -2.294665 2.611869 -2.581871
C  -1.952999 -2.111254 -0.798147
C  1.190033 2.233997 0.403525
C  1.781674 -1.112399 1.495081
C  2.180746 2.297828 1.393325
C  0.79771 -1.564794 2.365212
C  0.778114 -2.90965 2.695184
C  -4.943546 -1.068268 -4.548285
C  2.714736 -3.1687 1.323996
C  1.75963 -3.725891 2.161823
C  -0.960528 -4.30743 -0.455624
H  -1.294874 1.601176 -0.440369
H  -4.104528 1.432939 -4.201852
H  -3.670721 -2.584419 -2.794214
H  -2.801216 3.172263 -3.365508
H  -2.566716 3.07299 -1.62886
H  -1.220016 2.748673 -2.714442
H  0.737548 3.044963 -0.14389
H  -1.366936 -3.344991 -2.286638
H  0.020061 -3.305255 3.357678
H  3.502465 -3.779862 0.900999
H  1.782549 -4.781821 2.393359
H  0.018989 -4.020936 -0.06717
H  -0.843187 -5.211645 -1.047405
H  -1.613507 -4.534308 0.38594
elementType: Br Cl O N C H
totalener: -4245.96571983 hartree
nucrepener: 3392.04785170 hartree
electener: -7638.01357153 hartree
twoeener: 4978.94370761 hartree
cpcmener: -0.05646412 hartree
kineticenergy: 4236.69852437 hartree
xcener: -206.762464762515 hartree
chargesum: -0.0000000
charge: 0.002019 -0.049947 -0.444184 -0.495545 -0.132565 0.166873 -0.276727 -0.163455 -0.315460 -0.107718 0.154653 -0.060379 -0.006590 -0.046311 -0.124083 0.345606 -0.167736 0.189517 -0.256293 0.297465 -0.157849 0.142433 -0.003552 0.059621 -0.107763 -0.138177 0.023195 -0.118605 -0.163767 0.189845 0.139992 0.141786 0.099500 0.112688 0.116807 0.183284 0.182150 0.151087 0.150259 0.163189 0.094369 0.121864 0.108505
qa: 0.0020 -0.0499 -0.4442 -0.4955 -0.1326 0.1669 -0.2767 -0.1635 -0.3155 -0.1077 0.1547 -0.0604 -0.0066 -0.0463 -0.1241 0.3456 -0.1677 0.1895 -0.2563 0.2975 -0.1578 0.1424 -0.0036 0.0596 -0.1078 -0.1382 0.0232 -0.1186 -0.1638 0.1898 0.1400 0.1418 0.0995 0.1127 0.1168 0.1833 0.1822 0.1511 0.1503 0.1632 0.0944 0.1219 0.1085
va: 1.2330 1.2668 2.0586 2.0347 3.2555 3.2900 2.8561 3.2023 3.0688 3.1301 3.7836 3.8788 3.7052 3.8846 3.9642 4.1705 4.0591 3.7031 3.9113 4.1869 3.8886 3.9987 4.2622 3.9463 3.9664 4.0223 4.0015 3.8656 3.8990 0.9999 1.0118 1.0290 1.0051 0.9925 0.9960 0.9852 1.0020 1.0047 0.9971 0.9884 0.9921 1.0014 0.9996
dispcorr: -0.027627613 hartree
energy: -4245.993347439523
dipole: -39.61120 39.49077 -0.12043 -50.57747 50.23705 -0.34042 -34.46333 34.36033 -0.10300
magnitude: 0.37550 au
magnitude: 0.95444 debye
