program: Orca
programVersion: 5.0.2
elementType: Br Cl O O N N N N N N C C C C C C C C C C C C C C C C C C C H H H H H H H H H H H H H H
charge: 0
multiplicity: 1
keywords: wb97x-d3
keywords: def2-TZVPP
keywords: def2/J RIJCOSX
keywords: DEFGRID2
keywords: scfconv7
keywords: smallprint printgap noloewdin
keywords: NOSOSCF
formula: C19H14BrClN6O2
InChI: InChI=1/C19H14BrClN6O2/c1-10-6-11(9-22)7-12(18(28)23-2)16(10)25-19(29)14-8-15(20)26-27(14)17-13(21)4-3-5-24-17/h3-8,23,25H,1-2H3
43 atoms
Br 5.223272 -0.15355 0.303521
Cl 0.325348 2.708269 1.492626
O  -1.068824 -0.654944 0.582232
O  -1.99313 1.942321 -1.052295
N  -0.361614 -0.534102 -1.568994
N  1.530401 -0.01926 1.485817
N  2.836815 0.083746 1.68626
N  -3.637956 0.924721 0.133244
N  0.509738 -0.702164 3.461525
N  -6.172601 -2.002342 -4.66187
C  -1.585609 -0.812433 -2.193461
C  -1.590271 -1.775281 -3.211043
C  -2.762928 -0.159093 -1.815196
C  1.224381 -0.318939 0.199145
C  -2.788029 -2.066293 -3.84401
C  -0.17477 -0.512904 -0.23079
C  -3.95455 -0.484969 -2.442345
C  -3.965674 -1.434353 -3.458059
C  -0.332209 -2.486592 -3.604029
C  -2.744814 0.998312 -0.859692
C  2.421739 -0.431366 -0.469086
C  0.658121 0.252337 2.573448
C  3.377962 -0.167548 0.517526
C  0.049905 1.495846 2.675845
C  -0.779845 1.732885 3.7581
C  -5.187701 -1.749812 -4.120785
C  -0.276492 -0.475592 4.504229
C  -0.947796 0.722531 4.689178
C  -3.736266 1.892302 1.197857
H  0.448903 -0.465937 -2.168343
H  -2.808646 -2.804527 -4.635345
H  -4.871648 0.020393 -2.169023
H  0.4104 -1.802218 -4.021553
H  0.129736 -2.984417 -2.749724
H  -0.536133 -3.242004 -4.360331
H  2.592434 -0.68567 -1.50266
H  -4.124926 0.051553 0.264145
H  -1.276129 2.686734 3.873788
H  -0.375931 -1.281613 5.220357
H  -1.585957 0.866912 5.549614
H  -4.777715 2.166164 1.363948
H  -3.183961 2.791238 0.941239
H  -3.333513 1.49069 2.129421
elementType: Br Cl O N C H
totalener: -4245.96633124 hartree
nucrepener: 3371.73937520 hartree
electener: -7617.70570643 hartree
twoeener: 4958.42791350 hartree
cpcmener: -0.05629708 hartree
kineticenergy: 4236.72259481 hartree
xcener: -206.768640930908 hartree
chargesum: 0.0000000
charge: 0.003651 -0.047048 -0.456368 -0.491599 -0.139895 0.182207 -0.278705 -0.158426 -0.329872 -0.108567 0.166884 -0.075890 -0.012988 -0.053620 -0.122725 0.378750 -0.170722 0.197767 -0.252044 0.281597 -0.156443 0.166237 -0.001949 0.045127 -0.128387 -0.136778 0.006081 -0.093824 -0.165203 0.186827 0.139576 0.143123 0.110399 0.117207 0.098401 0.171256 0.179641 0.156973 0.149203 0.163797 0.122206 0.100204 0.113939
qa: 0.0037 -0.0470 -0.4564 -0.4916 -0.1399 0.1822 -0.2787 -0.1584 -0.3299 -0.1086 0.1669 -0.0759 -0.0130 -0.0536 -0.1227 0.3788 -0.1707 0.1978 -0.2520 0.2816 -0.1564 0.1662 -0.0019 0.0451 -0.1284 -0.1368 0.0061 -0.0938 -0.1652 0.1868 0.1396 0.1431 0.1104 0.1172 0.0984 0.1713 0.1796 0.1570 0.1492 0.1638 0.1222 0.1002 0.1139
va: 1.2352 1.2734 2.0531 2.0351 3.2851 3.3163 2.8559 3.1990 3.0683 3.1286 3.7695 3.9027 3.7202 3.9155 3.9622 4.1370 4.0612 3.6888 3.9159 4.2164 3.9072 3.9721 4.2638 3.9615 3.9645 4.0153 4.0351 3.8677 3.8761 1.0008 1.0120 1.0253 0.9939 0.9956 1.0049 0.9910 1.0017 1.0015 0.9971 0.9874 0.9975 1.0231 0.9886
dispcorr: -0.026686660 hartree
energy: -4245.993017895617
dipole: -70.88853 70.56832 -0.32021 -5.19901 4.76392 -0.43509 -6.95664 7.77802 0.82139
magnitude: 0.98311 au
magnitude: 2.49888 debye
