program: Orca
programVersion: 5.0.2
elementType: Br Cl O O N N N N N N C C C C C C C C C C C C C C C C C C C H H H H H H H H H H H H H H
charge: 0
multiplicity: 1
keywords: wb97x-d3
keywords: def2-TZVPP
keywords: def2/J RIJCOSX
keywords: DEFGRID2
keywords: scfconv7
keywords: smallprint printgap noloewdin
keywords: NOSOSCF
formula: C19H14BrClN6O2
InChI: InChI=1/C19H14BrClN6O2/c1-10-6-11(9-22)7-12(18(28)23-2)16(10)25-19(29)14-8-15(20)26-27(14)17-13(21)4-3-5-24-17/h3-8,23,25H,1-2H3
43 atoms
Br 4.605349 1.88437 0.732774
Cl 1.340933 0.03591 4.449329
O  -1.572316 0.917021 0.848549
O  -1.111849 -2.178192 -3.984416
N  -0.898485 0.840132 -1.330005
N  1.206551 0.140246 1.40172
N  2.505441 0.326385 1.630549
N  -0.31709 -1.939599 -1.892678
N  -0.159628 -1.711771 1.235708
N  -6.917922 -0.787989 -3.939765
C  -2.156287 0.511957 -1.881513
C  -3.22817 1.401206 -1.741022
C  -2.296926 -0.684145 -2.595797
C  0.738697 0.920499 0.394591
C  -4.454475 1.034452 -2.273924
C  -0.69755 0.903765 0.018655
C  -3.52347 -0.997584 -3.16198
C  -4.611038 -0.157559 -2.972594
C  -3.084429 2.733168 -1.070712
C  -1.18579 -1.663064 -2.888262
C  1.798106 1.670525 -0.041079
C  0.512303 -0.907275 2.035104
C  2.8635 1.252506 0.780968
C  0.527867 -1.059566 3.418967
C  -0.182763 -2.119818 3.958746
C  -5.886979 -0.505321 -3.512623
C  -0.858325 -2.70735 1.756819
C  -0.890553 -2.95892 3.117315
C  0.722365 -2.924665 -2.078755
H  -0.088865 0.59934 -1.881536
H  -5.300778 1.700146 -2.164098
H  -3.627688 -1.902856 -3.743666
H  -2.105781 3.174181 -1.25705
H  -3.837433 3.428101 -1.439236
H  -3.205163 2.647203 0.008559
H  1.805175 2.436415 -0.797713
H  -0.501005 -1.656304 -0.94035
H  -0.193886 -2.266651 5.029979
H  -1.406543 -3.328287 1.059453
H  -1.461762 -3.78707 3.510977
H  1.355659 -2.920631 -1.194739
H  1.335158 -2.68772 -2.947029
H  0.319739 -3.92973 -2.220006
totalener: -4245.92906513 hartree
nucrepener: 3349.64382379 hartree
electener: -7595.57288892 hartree
twoeener: 4934.10540143 hartree
kineticenergy: 4236.78246758 hartree
xcener: -206.769988610204 hartree
chargesum: -0.0000000
charge: 0.020726 -0.013283 -0.345065 -0.385499 -0.215472 0.162298 -0.274134 -0.260028 -0.373653 -0.008968 0.157686 -0.044597 -0.001401 0.009244 -0.116750 0.227215 -0.141004 0.183162 -0.251698 0.269000 -0.198652 0.291039 0.037605 -0.030314 -0.075409 -0.199158 0.087757 -0.136340 -0.159660 0.157931 0.116276 0.133479 0.093507 0.094047 0.128572 0.163890 0.198599 0.128171 0.116067 0.137563 0.096250 0.112648 0.108356
qa: 0.0207 -0.0133 -0.3451 -0.3855 -0.2155 0.1623 -0.2741 -0.2600 -0.3737 -0.0090 0.1577 -0.0446 -0.0014 0.0092 -0.1168 0.2272 -0.1410 0.1832 -0.2517 0.2690 -0.1987 0.2910 0.0376 -0.0303 -0.0754 -0.1992 0.0878 -0.1363 -0.1597 0.1579 0.1163 0.1335 0.0935 0.0940 0.1286 0.1639 0.1986 0.1282 0.1161 0.1376 0.0962 0.1126 0.1084
va: 1.2468 1.3006 2.1522 2.1395 3.2019 3.3281 2.8231 3.1271 3.0425 3.1343 3.7636 3.9628 3.7699 3.7427 4.0080 4.2076 4.0731 3.7519 3.8774 4.2081 3.9198 3.8109 4.2182 4.1035 3.9800 4.0042 3.9750 3.9781 3.9154 1.0371 1.0185 1.0348 1.0061 1.0047 1.0019 0.9990 1.0142 1.0128 1.0042 0.9992 1.0031 1.0007 0.9926
dispcorr: -0.026457266 hartree
energy: -4245.955522399121
dipole: -60.38628 61.63794 1.25166 -25.57126 25.52154 -0.04972 -21.32241 23.27012 1.94770
magnitude: 2.31574 au
magnitude: 5.88615 debye
