program: Orca
programVersion: 5.0.2
elementType: Br Cl O O N N N N N N C C C C C C C C C C C C C C C C C C C H H H H H H H H H H H H H H
charge: 0
multiplicity: 1
keywords: wb97x-d3
keywords: def2-TZVPP
keywords: def2/J RIJCOSX
keywords: DEFGRID2
keywords: scfconv7
keywords: smallprint printgap noloewdin
keywords: NOSOSCF
formula: C19H14BrClN6O2
InChI: InChI=1/C19H14BrClN6O2/c1-10-6-11(9-22)7-12(18(28)23-2)16(10)25-19(29)14-8-15(20)26-27(14)17-13(21)4-3-5-24-17/h3-8,23,25H,1-2H3
43 atoms
Br 4.307192 2.227999 0.952368
Cl 0.1138 1.344939 4.312167
O  -1.564698 -0.057412 0.745318
O  0.445104 -1.060775 -3.361872
N  -0.754386 0.351585 -1.351191
N  1.114881 0.168074 1.738321
N  2.321072 0.631315 2.040239
N  -0.792377 -2.893412 -3.772606
N  0.386951 -1.98245 2.209452
N  -6.351896 -0.884858 -4.928358
C  -1.930965 0.092332 -2.059852
C  -3.09878 0.820797 -1.795847
C  -1.912126 -0.878972 -3.075547
C  0.692819 0.567587 0.515115
C  -4.234611 0.533063 -2.538963
C  -0.655481 0.243972 0.008153
C  -3.054838 -1.12087 -3.819941
C  -4.22578 -0.42657 -3.543471
C  -3.147184 1.93235 -0.793866
C  -0.645106 -1.606929 -3.404907
C  1.694153 1.354113 -0.001797
C  0.482581 -0.740431 2.62052
C  2.67335 1.349704 1.001846
C  0.012901 -0.301703 3.853202
C  -0.568333 -1.235005 4.694552
C  -5.402261 -0.676365 -4.311347
C  -0.185667 -2.869899 3.005412
C  -0.670834 -2.545568 4.262258
C  0.343598 -3.714498 -4.121435
H  0.095134 0.220084 -1.889764
H  -5.142178 1.092321 -2.351671
H  -3.039097 -1.828702 -4.638112
H  -3.344566 1.556553 0.209227
H  -2.207143 2.4825 -0.75762
H  -3.934339 2.639167 -1.052179
H  1.712342 1.882265 -0.939747
H  -1.674685 -3.344098 -3.606326
H  -0.944176 -0.932929 5.662178
H  -0.254509 -3.882163 2.626718
H  -1.123313 -3.300512 4.88956
H  0.962822 -3.948846 -3.254351
H  0.966724 -3.209751 -4.856211
H  -0.016797 -4.643439 -4.555567
totalener: -4245.93414653 hartree
nucrepener: 3277.03539467 hartree
electener: -7522.96954120 hartree
twoeener: 4863.02641291 hartree
kineticenergy: 4236.78408579 hartree
xcener: -206.770426934635 hartree
chargesum: 0.0000000
charge: 0.008964 -0.031480 -0.379580 -0.434596 -0.220926 0.167516 -0.260877 -0.205648 -0.298824 -0.008600 0.148409 -0.012819 -0.007138 -0.022959 -0.130553 0.316344 -0.218183 0.187539 -0.242967 0.353715 -0.179523 0.212104 0.019865 0.027747 -0.101938 -0.205569 0.004129 -0.088788 -0.152738 0.190268 0.116591 0.136084 0.129644 0.097911 0.090755 0.152217 0.148102 0.124063 0.118056 0.131476 0.112344 0.113130 0.096733
qa: 0.0090 -0.0315 -0.3796 -0.4346 -0.2209 0.1675 -0.2609 -0.2056 -0.2988 -0.0086 0.1484 -0.0128 -0.0071 -0.0230 -0.1306 0.3163 -0.2182 0.1875 -0.2430 0.3537 -0.1795 0.2121 0.0199 0.0277 -0.1019 -0.2056 0.0041 -0.0888 -0.1527 0.1903 0.1166 0.1361 0.1296 0.0979 0.0908 0.1522 0.1481 0.1241 0.1181 0.1315 0.1123 0.1131 0.0967
va: 1.2369 1.2867 2.1146 2.0688 3.1841 3.3573 2.8229 3.2081 3.0919 3.1351 3.8767 3.9305 3.7587 3.8559 4.0286 4.1658 4.0528 3.7778 3.8791 4.1057 3.9416 3.8827 4.2349 4.0695 4.0088 4.0086 4.0634 3.8754 3.9136 1.0478 1.0183 1.0365 1.0039 1.0057 1.0047 1.0054 1.0226 1.0150 1.0013 0.9985 0.9914 1.0007 0.9990
dispcorr: -0.023129310 hartree
energy: -4245.957275844131
dipole: -56.84942 56.73826 -0.11115 -36.90374 35.60052 -1.30321 -28.31569 28.80186 0.48617
magnitude: 1.39538 au
magnitude: 3.54677 debye
