program: Orca
programVersion: 5.0.2
elementType: Br Cl O O N N N N N N C C C C C C C C C C C C C C C C C C C H H H H H H H H H H H H H H
charge: 0
multiplicity: 1
keywords: wb97x-d3
keywords: def2-TZVPP
keywords: def2/J RIJCOSX
keywords: DEFGRID2
keywords: scfconv7
keywords: smallprint printgap noloewdin
keywords: NOSOSCF
formula: C19H14BrClN6O2
InChI: InChI=1/C19H14BrClN6O2/c1-10-6-11(9-22)7-12(18(28)23-2)16(10)25-19(29)14-8-15(20)26-27(14)17-13(21)4-3-5-24-17/h3-8,23,25H,1-2H3
43 atoms
Br 4.707287 -1.014229 1.782092
Cl 0.069571 2.680657 0.30869
O  -1.518815 -0.264256 1.058581
O  0.4606 -0.134105 -3.152205
N  -0.537885 -1.118605 -0.818433
N  1.106272 0.414048 2.017588
N  2.37437 0.34764 2.403064
N  -1.08606 1.193883 -4.099955
N  0.021267 1.122141 3.937759
N  -6.092938 -2.127621 -4.530058
C  -1.707189 -1.31917 -1.558236
C  -2.723428 -2.154188 -1.074719
C  -1.827201 -0.705839 -2.81729
C  0.829972 -0.427662 0.990429
C  -3.85685 -2.328608 -1.855325
C  -0.530277 -0.579327 0.43734
C  -2.95778 -0.927164 -3.586667
C  -3.984682 -1.726589 -3.100908
C  -2.602879 -2.907812 0.213388
C  -0.711822 0.135138 -3.357681
C  2.000925 -1.085465 0.702895
C  0.244206 1.333363 2.663822
C  2.917006 -0.552787 1.621038
C  -0.288622 2.414936 1.968386
C  -1.117354 3.286526 2.650627
C  -5.151051 -1.950802 -3.891766
C  -0.758143 1.963638 4.596131
C  -1.359641 3.05655 3.993843
C  -0.113862 2.090628 -4.680584
H  0.292553 -0.980373 -1.384783
H  -4.647957 -2.975277 -1.498349
H  -3.040689 -0.50436 -4.579264
H  -3.226378 -3.800333 0.189838
H  -1.57684 -3.225255 0.397544
H  -2.91416 -2.299543 1.061584
H  2.172751 -1.855615 -0.029523
H  -2.048218 1.482052 -4.079089
H  -1.554615 4.132681 2.13926
H  -0.912112 1.752046 5.647065
H  -2.000678 3.716354 4.561247
H  -0.620727 2.749674 -5.381521
H  0.645367 1.530077 -5.222081
H  0.387265 2.699327 -3.925721
totalener: -4245.93309779 hartree
nucrepener: 3326.67897925 hartree
electener: -7572.61207705 hartree
twoeener: 4912.39997246 hartree
kineticenergy: 4236.77939082 hartree
xcener: -206.770890572579 hartree
chargesum: 0.0000000
charge: 0.008812 -0.056701 -0.369760 -0.433877 -0.208457 0.174130 -0.245043 -0.202941 -0.275810 -0.008905 0.150035 -0.012923 -0.002838 -0.016813 -0.128757 0.286676 -0.214491 0.187924 -0.241730 0.341826 -0.203146 0.196426 0.023143 0.039191 -0.096656 -0.205974 0.005070 -0.096005 -0.150351 0.191104 0.116744 0.136179 0.091156 0.098721 0.129311 0.150798 0.148278 0.123667 0.122360 0.130036 0.097861 0.113418 0.108312
qa: 0.0088 -0.0567 -0.3698 -0.4339 -0.2085 0.1741 -0.2450 -0.2029 -0.2758 -0.0089 0.1500 -0.0129 -0.0028 -0.0168 -0.1288 0.2867 -0.2145 0.1879 -0.2417 0.3418 -0.2031 0.1964 0.0231 0.0392 -0.0967 -0.2060 0.0051 -0.0960 -0.1504 0.1911 0.1167 0.1362 0.0912 0.0987 0.1293 0.1508 0.1483 0.1237 0.1224 0.1300 0.0979 0.1134 0.1083
va: 1.2358 1.2651 2.1206 2.0683 3.1758 3.3387 2.8735 3.2066 3.1007 3.1340 3.8707 3.9350 3.7588 3.8106 4.0261 4.1690 4.0464 3.7761 3.8767 4.1099 3.9916 3.9757 4.2397 3.9978 4.0122 4.0074 4.0606 3.8824 3.9148 1.0488 1.0184 1.0360 1.0044 1.0060 1.0044 1.0051 1.0225 1.0139 0.9998 0.9989 0.9989 1.0009 0.9916
dispcorr: -0.024117677 hartree
energy: -4245.957215471612
dipole: -61.69978 61.23919 -0.46059 8.19762 -6.74139 1.45623 -28.45810 28.23262 -0.22548
magnitude: 1.54389 au
magnitude: 3.92425 debye
