program: Orca
programVersion: 5.0.2
elementType: Br Cl O O N N N N N N C C C C C C C C C C C C C C C C C C C H H H H H H H H H H H H H H
charge: 0
multiplicity: 1
keywords: wb97x-d3
keywords: def2-TZVPP
keywords: def2/J RIJCOSX
keywords: DEFGRID2
keywords: scfconv7
keywords: smallprint printgap noloewdin
keywords: NOSOSCF
formula: C19H14BrClN6O2
InChI: InChI=1/C19H14BrClN6O2/c1-10-6-11(9-22)7-12(18(28)23-2)16(10)25-19(29)14-8-15(20)26-27(14)17-13(21)4-3-5-24-17/h3-8,23,25H,1-2H3
43 atoms
Br 4.69529 -1.123907 1.974815
Cl 0.054894 2.414513 0.005838
O  -1.498426 -0.444872 1.099626
O  0.405823 -0.015072 -3.090643
N  -0.497784 -1.229531 -0.79577
N  1.120509 0.385421 1.986625
N  2.378341 0.330739 2.408347
N  -1.216102 1.373126 -3.800623
N  0.058579 1.338689 3.809814
N  -6.111154 -2.098099 -4.455572
C  -1.67733 -1.403092 -1.531448
C  -2.657298 -2.301178 -1.09193
C  -1.850371 -0.684293 -2.724923
C  0.852594 -0.538271 1.030476
C  -3.804222 -2.448695 -1.858538
C  -0.502402 -0.718746 0.471389
C  -2.994593 -0.873014 -3.482879
C  -3.98072 -1.748726 -3.045565
C  -2.486939 -3.13289 0.140977
C  -0.779774 0.244839 -3.209191
C  2.015166 -1.239405 0.829639
C  0.263932 1.379346 2.515789
C  2.919896 -0.645408 1.7238
C  -0.283258 2.359905 1.691963
C  -1.105292 3.312498 2.265827
C  -5.159157 -1.946375 -3.825993
C  -0.712965 2.259024 4.36271
C  -1.326787 3.262811 3.631226
C  -0.296681 2.358662 -4.319565
H  0.327147 -1.051555 -1.357561
H  -4.567896 -3.145263 -1.537486
H  -3.118948 -0.363009 -4.429164
H  -3.080523 -4.043417 0.071727
H  -1.447175 -3.423525 0.288371
H  -2.804382 -2.58943 1.030567
H  2.184632 -2.074267 0.171361
H  -2.183618 1.625808 -3.70323
H  -1.551238 4.084415 1.654183
H  -0.84977 2.188154 5.43476
H  -1.960533 3.991671 4.116334
H  0.238906 2.880677 -3.524769
H  -0.856254 3.087639 -4.90028
H  0.437851 1.889927 -4.97078
totalener: -4245.93221027 hartree
nucrepener: 3348.30461652 hartree
electener: -7594.23682678 hartree
twoeener: 4933.91511106 hartree
kineticenergy: 4236.77891222 hartree
xcener: -206.769728220209 hartree
chargesum: 0.0000000
charge: 0.009102 -0.061478 -0.359704 -0.428322 -0.204854 0.172497 -0.246003 -0.198254 -0.275600 -0.008208 0.150142 -0.011796 0.019223 0.017405 -0.129458 0.239089 -0.219639 0.192568 -0.241901 0.310498 -0.216895 0.196441 0.026222 0.047367 -0.095937 -0.205863 0.007022 -0.098640 -0.146326 0.192625 0.116458 0.136937 0.091997 0.097617 0.128919 0.154586 0.149308 0.123959 0.122899 0.131530 0.102812 0.097528 0.114128
qa: 0.0091 -0.0615 -0.3597 -0.4283 -0.2049 0.1725 -0.2460 -0.1983 -0.2756 -0.0082 0.1501 -0.0118 0.0192 0.0174 -0.1295 0.2391 -0.2196 0.1926 -0.2419 0.3105 -0.2169 0.1964 0.0262 0.0474 -0.0959 -0.2059 0.0070 -0.0986 -0.1463 0.1926 0.1165 0.1369 0.0920 0.0976 0.1289 0.1546 0.1493 0.1240 0.1229 0.1315 0.1028 0.0975 0.1141
va: 1.2361 1.2682 2.1287 2.0713 3.1605 3.3353 2.8762 3.1915 3.1038 3.1345 3.8598 3.9480 3.7499 3.7622 4.0282 4.2069 4.0439 3.7727 3.8750 4.1235 3.9925 3.9827 4.2340 3.9855 4.0053 4.0065 4.0592 3.8844 3.9185 1.0435 1.0186 1.0355 1.0041 1.0069 1.0037 1.0038 1.0222 1.0141 0.9995 0.9986 0.9913 0.9990 1.0005
dispcorr: -0.024921004 hartree
energy: -4245.957131269023
dipole: -61.73787 61.25906 -0.47880 10.25867 -8.76712 1.49155 -29.45093 29.25090 -0.20003
magnitude: 1.57924 au
magnitude: 4.01410 debye
