program: Orca
programVersion: 5.0.2
elementType: Br Cl O O N N N N N N C C C C C C C C C C C C C C C C C C C H H H H H H H H H H H H H H
charge: 0
multiplicity: 1
keywords: wb97x-d3
keywords: def2-TZVPP
keywords: def2/J RIJCOSX
keywords: DEFGRID2
keywords: scfconv7
keywords: smallprint printgap noloewdin
keywords: NOSOSCF
formula: C19H14BrClN6O2
InChI: InChI=1/C19H14BrClN6O2/c1-10-6-11(9-22)7-12(18(28)23-2)16(10)25-19(29)14-8-15(20)26-27(14)17-13(21)4-3-5-24-17/h3-8,23,25H,1-2H3
43 atoms
Br 4.712189 -1.111275 1.995575
Cl 0.068677 2.35953 -0.082671
O  -1.478353 -0.474538 1.118805
O  0.352055 0.071764 -3.069359
N  -0.48398 -1.232454 -0.790103
N  1.14045 0.404389 1.968959
N  2.398027 0.356725 2.3935
N  -1.322727 1.443023 -3.695073
N  0.089025 1.428403 3.759735
N  -6.130456 -2.128915 -4.392054
C  -1.670983 -1.411628 -1.513668
C  -2.625789 -2.339269 -1.080643
C  -1.878579 -0.666159 -2.684325
C  0.872617 -0.538523 1.031926
C  -3.780297 -2.494859 -1.834272
C  -0.484249 -0.731468 0.480738
C  -3.02926 -0.862083 -3.430424
C  -3.988835 -1.770811 -3.00158
C  -2.420726 -3.189184 0.134381
C  -0.841072 0.30641 -3.155397
C  2.033914 -1.245355 0.846991
C  0.287481 1.418195 2.464054
C  2.938367 -0.634593 1.730684
C  -0.264328 2.366573 1.605851
C  -1.085107 3.339312 2.14636
C  -5.174352 -1.970429 -3.770743
C  -0.680156 2.36915 4.2804
C  -1.299707 3.342497 3.513602
C  -0.451618 2.481534 -4.19228
H  0.332089 -1.03474 -1.357679
H  -4.524563 -3.214452 -1.518421
H  -3.180012 -0.329527 -4.360254
H  -3.003307 -4.106362 0.062237
H  -1.37454 -3.467449 0.257126
H  -2.728213 -2.664446 1.038536
H  2.202073 -2.094032 0.206548
H  -2.293551 1.663451 -3.558113
H  -1.534611 4.086643 1.507484
H  -0.810405 2.34076 5.355146
H  -1.931706 4.08912 3.973158
H  0.364393 2.045305 -4.76296
H  -0.021581 3.081275 -3.38744
H  -1.020569 3.136002 -4.848699
totalener: -4245.93183536 hartree
nucrepener: 3355.47455115 hartree
electener: -7601.40638651 hartree
twoeener: 4941.04287774 hartree
kineticenergy: 4236.78521665 hartree
xcener: -206.770808429356 hartree
chargesum: 0.0000000
charge: 0.009142 -0.060822 -0.356659 -0.426933 -0.203688 0.171889 -0.245885 -0.194307 -0.275470 -0.007760 0.147508 -0.011095 0.029584 0.023443 -0.130693 0.229121 -0.221645 0.194670 -0.241395 0.295873 -0.219845 0.194881 0.026830 0.050509 -0.095630 -0.205862 0.007510 -0.098888 -0.146280 0.193316 0.116500 0.137715 0.092008 0.097330 0.128515 0.155209 0.149051 0.123498 0.123151 0.131646 0.114412 0.099798 0.099745
qa: 0.0091 -0.0608 -0.3567 -0.4269 -0.2037 0.1719 -0.2459 -0.1943 -0.2755 -0.0078 0.1475 -0.0111 0.0296 0.0234 -0.1307 0.2291 -0.2216 0.1947 -0.2414 0.2959 -0.2198 0.1949 0.0268 0.0505 -0.0956 -0.2059 0.0075 -0.0989 -0.1463 0.1933 0.1165 0.1377 0.0920 0.0973 0.1285 0.1552 0.1491 0.1235 0.1232 0.1316 0.1144 0.0998 0.0997
va: 1.2362 1.2723 2.1315 2.0697 3.1560 3.3340 2.8770 3.1857 3.1047 3.1344 3.8604 3.9501 3.7334 3.7518 4.0292 4.2144 4.0426 3.7693 3.8746 4.1343 3.9931 3.9857 4.2327 3.9819 4.0016 4.0058 4.0587 3.8850 3.9133 1.0415 1.0188 1.0350 1.0042 1.0071 1.0036 1.0036 1.0216 1.0144 0.9994 0.9986 1.0041 0.9914 0.9989
dispcorr: -0.025180955 hartree
energy: -4245.957016317291
dipole: -62.19239 61.69542 -0.49697 10.62823 -9.13245 1.49579 -29.28118 29.09123 -0.18994
magnitude: 1.58759 au
magnitude: 4.03533 debye
