program: Orca
programVersion: 5.0.2
elementType: Br Cl Cl O O N N N N N C C C C C C C C C C C C C C C C C C H H H H H H H H H H H H H H
charge: 0
multiplicity: 1
keywords: wb97x-d3
keywords: def2-TZVPP
keywords: def2/J RIJCOSX
keywords: DEFGRID2
keywords: scfconv7
keywords: smallprint printgap noloewdin
keywords: NOSOSCF
formula: C18H14BrCl2N5O2
InChI: InChI=1/C18H14BrCl2N5O2/c1-9-6-10(20)7-11(17(27)22-2)15(9)24-18(28)13-8-14(19)25-26(13)16-12(21)4-3-5-23-16/h3-8,22,24H,1-2H3
42 atoms
Br -4.660633 -2.101161 -1.511442
Cl 6.780249 -1.339455 1.153775
Cl -2.711494 1.272326 2.610424
O  0.469388 0.592764 0.990849
O  1.936153 0.933434 -1.786158
N  1.023546 -1.296845 -0.12806
N  -2.102591 0.506495 -0.201624
N  -3.307723 0.150499 -0.630278
N  2.965517 2.230934 -0.243753
N  -1.415424 2.633457 -0.85542
C  2.399177 -1.279088 0.170531
C  2.965077 -2.431465 0.721928
C  3.18222 -0.148069 -0.076114
C  -1.231438 -0.531109 -0.178976
C  0.158674 -0.35465 0.286057
C  4.324171 -2.439707 1.01193
C  4.535158 -0.167855 0.24015
C  2.12753 -3.641239 1.001138
C  5.091374 -1.313356 0.778197
C  -1.925244 -1.633425 -0.620006
C  2.619138 1.055192 -0.773701
C  -1.86484 1.870701 0.114969
C  -3.206253 -1.135206 -0.878229
C  -2.140447 2.33828 1.391982
C  -1.923584 3.677517 1.663503
C  -1.200394 3.917242 -0.596501
C  -1.440732 4.481949 0.645275
C  2.501909 3.505632 -0.738567
H  0.675523 -2.087403 -0.654756
H  4.771934 -3.329117 1.435318
H  5.156738 0.694898 0.041526
H  1.711847 -4.065238 0.084756
H  2.719259 -4.41758 1.482119
H  1.287747 -3.404137 1.655587
H  -1.57031 -2.646047 -0.723947
H  3.463751 2.232721 0.632083
H  -2.120942 4.080883 2.647375
H  -0.825205 4.51887 -1.414227
H  -1.251981 5.532255 0.81512
H  1.660444 3.875214 -0.151553
H  2.191112 3.422497 -1.775243
H  3.305751 4.235929 -0.680943
elementType: Br Cl O N C H
totalener: -4613.32792986 hartree
nucrepener: 3419.14917586 hartree
electener: -8032.47710572 hartree
twoeener: 5151.93679786 hartree
cpcmener: -0.06353182 hartree
kineticenergy: 4603.79715853 hartree
xcener: -219.224105580217 hartree
chargesum: -0.0000000
charge: 0.001974 -0.087302 -0.051192 -0.498114 -0.545306 -0.134846 0.180939 -0.284882 -0.155615 -0.327667 0.084225 -0.076097 -0.010916 -0.025108 0.361355 -0.103636 -0.165176 -0.236820 0.101150 -0.155647 0.346010 0.152070 -0.003986 0.032910 -0.091549 -0.028568 -0.080806 -0.163594 0.194552 0.127824 0.129763 0.112404 0.098148 0.113486 0.181799 0.186551 0.151691 0.160054 0.166737 0.113319 0.105123 0.124746
qa: 0.0020 -0.0873 -0.0512 -0.4981 -0.5453 -0.1348 0.1809 -0.2849 -0.1556 -0.3277 0.0842 -0.0761 -0.0109 -0.0251 0.3614 -0.1036 -0.1652 -0.2368 0.1012 -0.1556 0.3460 0.1521 -0.0040 0.0329 -0.0915 -0.0286 -0.0808 -0.1636 0.1946 0.1278 0.1298 0.1124 0.0981 0.1135 0.1818 0.1866 0.1517 0.1601 0.1667 0.1133 0.1051 0.1247
va: 1.2347 1.2171 1.2682 2.0059 1.9629 3.2780 3.3034 2.8411 3.2310 3.0550 3.7852 3.9025 3.6866 3.9397 4.1247 3.9589 4.0751 3.9038 3.8666 3.8809 4.1563 3.9555 4.2587 3.9937 3.9820 4.0123 3.8429 3.8747 0.9935 1.0156 1.0333 0.9944 1.0056 0.9968 0.9876 0.9968 1.0039 0.9922 0.9862 0.9904 1.0164 0.9969
dispcorr: -0.025886232 hartree
energy: -4613.353816093457
dipole: 57.77073 -56.01271 1.75802 27.77644 -27.41822 0.35822 12.07964 -10.35541 1.72424
magnitude: 2.48836 au
magnitude: 6.32491 debye
