program: Orca
programVersion: 5.0.2
elementType: Br Cl Cl O O N N N N N C C C C C C C C C C C C C C C C C C H H H H H H H H H H H H H H
charge: 0
multiplicity: 1
keywords: wb97x-d3
keywords: def2-TZVPP
keywords: def2/J RIJCOSX
keywords: DEFGRID2
keywords: scfconv7
keywords: smallprint printgap noloewdin
keywords: NOSOSCF
formula: C18H14BrCl2N5O2
InChI: InChI=1/C18H14BrCl2N5O2/c1-9-6-10(20)7-11(17(27)22-2)15(9)24-18(28)13-8-14(19)25-26(13)16-12(21)4-3-5-23-16/h3-8,22,24H,1-2H3
42 atoms
Br -3.994126 -2.214219 0.363784
Cl 4.621258 -1.170544 -2.219814
Cl -1.285083 3.336759 -0.193725
O  -0.748135 1.798697 2.959692
O  1.10612 -1.368074 2.76688
N  1.077886 1.438309 1.708656
N  -1.094811 0.303022 -0.235489
N  -2.024687 -0.555741 -0.655007
N  0.442687 -2.493448 0.929144
N  0.305739 0.240743 -2.078048
C  1.908254 0.769182 0.790719
C  2.780317 1.56045 0.031699
C  1.910487 -0.620909 0.65182
C  -1.085058 0.423349 1.119783
C  -0.23064 1.27347 1.986996
C  3.61996 0.945518 -0.886433
C  2.746255 -1.214638 -0.288601
C  2.835447 3.045644 0.213801
C  3.588932 -0.427502 -1.047387
C  -2.075531 -0.399373 1.593669
C  1.107484 -1.516352 1.547477
C  -0.342725 0.994912 -1.215285
C  -2.605365 -0.983929 0.438982
C  -0.349244 2.382613 -1.278534
C  0.405911 3.000509 -2.2634
C  1.024757 0.83016 -3.019305
C  1.115458 2.20839 -3.144792
C  -0.355879 -3.461209 1.643071
H  1.534326 2.126745 2.29716
H  4.289467 1.55236 -1.481748
H  2.759292 -2.289803 -0.405712
H  1.846358 3.503279 0.205731
H  3.296713 3.306588 1.169674
H  3.426995 3.510133 -0.572246
H  -2.346187 -0.572445 2.621579
H  0.416577 -2.504258 -0.078449
H  0.430776 4.078793 -2.338749
H  1.551313 0.178663 -3.70483
H  1.721192 2.651126 -3.922198
H  -0.954196 -4.011256 0.923295
H  -1.025603 -2.980517 2.355115
H  0.266088 -4.17466 2.184543
elementType: Br Cl O N C H
totalener: -4613.31868579 hartree
nucrepener: 3719.95522579 hartree
electener: -8333.27391158 hartree
twoeener: 5449.95032190 hartree
cpcmener: -0.05867699 hartree
kineticenergy: 4603.79592622 hartree
xcener: -219.235176915596 hartree
chargesum: 0.0000000
charge: 0.005688 -0.086940 -0.046229 -0.477229 -0.525575 -0.094903 0.261290 -0.287034 -0.151587 -0.331139 0.026266 -0.010842 0.069098 -0.035784 0.261041 -0.182896 -0.202134 -0.259168 0.155307 -0.181459 0.327845 0.233701 -0.016928 -0.078568 -0.070029 0.022469 -0.108481 -0.191378 0.187494 0.124090 0.122995 0.111067 0.130632 0.105314 0.180113 0.190695 0.154225 0.147492 0.163952 0.119599 0.108382 0.129546
qa: 0.0057 -0.0869 -0.0462 -0.4772 -0.5256 -0.0949 0.2613 -0.2870 -0.1516 -0.3311 0.0263 -0.0108 0.0691 -0.0358 0.2610 -0.1829 -0.2021 -0.2592 0.1553 -0.1815 0.3278 0.2337 -0.0169 -0.0786 -0.0700 0.0225 -0.1085 -0.1914 0.1875 0.1241 0.1230 0.1111 0.1306 0.1053 0.1801 0.1907 0.1542 0.1475 0.1640 0.1196 0.1084 0.1295
va: 1.2361 1.2169 1.2782 2.0285 1.9882 3.1870 3.2431 2.8584 3.1767 3.0217 3.7129 3.7409 3.6336 3.7659 4.2889 3.9912 4.1105 3.9013 3.7696 3.8515 4.1459 3.8354 4.2458 3.9756 3.9130 3.9983 3.8588 3.8974 1.0074 1.0196 1.0363 0.9994 0.9931 1.0021 0.9958 1.0009 1.0015 0.9988 0.9887 0.9955 0.9954 0.9957
dispcorr: -0.035947686 hartree
energy: -4613.354633477912
dipole: 48.76417 -46.47770 2.28648 21.75111 -20.49644 1.25466 -0.73630 -2.49170 -3.22800
magnitude: 4.14995 au
magnitude: 10.54834 debye
