program: Orca
programVersion: 5.0.2
elementType: Br Cl Cl O O N N N N N C C C C C C C C C C C C C C C C C C H H H H H H H H H H H H H H
charge: 0
multiplicity: 1
keywords: wb97x-d3
keywords: def2-TZVPP
keywords: def2/J RIJCOSX
keywords: DEFGRID2
keywords: scfconv7
keywords: smallprint printgap noloewdin
keywords: NOSOSCF
formula: C18H14BrCl2N5O2
InChI: InChI=1/C18H14BrCl2N5O2/c1-9-6-10(20)7-11(17(27)22-2)15(9)24-18(28)13-8-14(19)25-26(13)16-12(21)4-3-5-23-16/h3-8,22,24H,1-2H3
42 atoms
Br -4.783111 -2.248745 -0.585441
Cl 6.884401 -1.266797 0.442835
Cl -1.53242 1.887963 -2.883442
O  0.672458 0.940126 -0.291737
O  1.294443 -0.001731 2.575854
N  1.006988 -1.286217 -0.062559
N  -2.117831 0.555393 -0.291005
N  -3.369784 0.125425 -0.379187
N  2.68265 1.704708 2.086188
N  -1.969708 2.496563 0.986221
C  2.406891 -1.245239 0.073207
C  3.164019 -2.087992 -0.747152
C  3.032682 -0.40095 0.994956
C  -1.217264 -0.458512 -0.294669
C  0.233334 -0.19662 -0.218709
C  4.547034 -2.091941 -0.615645
C  4.419129 -0.405223 1.09722
C  2.505763 -2.970943 -1.762339
C  5.160518 -1.25285 0.295958
C  -1.944975 -1.623098 -0.385379
C  2.246651 0.450726 1.946588
C  -1.886446 1.954656 -0.20655
C  -3.270028 -1.182977 -0.437339
C  -1.628024 2.678378 -1.361764
C  -1.425972 4.042127 -1.253133
C  -1.773948 3.805563 1.094494
C  -1.498714 4.615106 0.005617
C  2.006438 2.666576 2.924991
H  0.580267 -2.201459 -0.103938
H  5.138597 -2.746481 -1.242398
H  4.91574 0.23048 1.817713
H  1.899366 -2.39195 -2.460241
H  3.249768 -3.517213 -2.338172
H  1.846779 -3.706808 -1.296633
H  -1.585653 -2.638804 -0.415501
H  3.408946 2.038462 1.472587
H  -1.214627 4.641908 -2.127657
H  -1.84375 4.224668 2.089538
H  -1.344441 5.676534 0.137127
H  2.625523 3.554758 2.997485
H  1.853618 2.277277 3.928761
H  1.038466 2.954553 2.511685
elementType: Br Cl O N C H
totalener: -4613.32861567 hartree
nucrepener: 3411.36802827 hartree
electener: -8024.69664394 hartree
twoeener: 5144.07122474 hartree
cpcmener: -0.06299869 hartree
kineticenergy: 4603.79756499 hartree
xcener: -219.224243046787 hartree
chargesum: 0.0000000
charge: 0.003048 -0.087557 -0.052645 -0.500977 -0.548395 -0.129098 0.188862 -0.286303 -0.164024 -0.332064 0.075728 -0.066851 -0.009843 -0.062851 0.396279 -0.102020 -0.170881 -0.238878 0.101195 -0.151948 0.360607 0.147142 0.001200 0.037517 -0.095311 -0.002713 -0.091519 -0.158827 0.193581 0.127852 0.129425 0.114518 0.097424 0.111505 0.177687 0.189243 0.152588 0.153967 0.166681 0.117936 0.108612 0.100109
qa: 0.0030 -0.0876 -0.0526 -0.5010 -0.5484 -0.1291 0.1889 -0.2863 -0.1640 -0.3321 0.0757 -0.0669 -0.0098 -0.0629 0.3963 -0.1020 -0.1709 -0.2389 0.1012 -0.1519 0.3606 0.1471 0.0012 0.0375 -0.0953 -0.0027 -0.0915 -0.1588 0.1936 0.1279 0.1294 0.1145 0.0974 0.1115 0.1777 0.1892 0.1526 0.1540 0.1667 0.1179 0.1086 0.1001
va: 1.2357 1.2169 1.2674 2.0039 1.9612 3.2924 3.2913 2.8504 3.2176 3.0513 3.7959 3.8907 3.7298 3.9713 4.0946 3.9579 4.0798 3.9052 3.8668 3.8926 4.1341 3.9804 4.2596 3.9788 3.9888 3.9980 3.8598 3.9053 0.9931 1.0155 1.0345 0.9967 1.0054 0.9947 0.9889 0.9968 1.0037 0.9964 0.9862 0.9987 0.9989 0.9848
dispcorr: -0.025023487 hartree
energy: -4613.353639159459
dipole: 56.56317 -54.34004 2.22314 27.97710 -27.11397 0.86313 13.53560 -14.86078 -1.32519
magnitude: 2.72827 au
magnitude: 6.93471 debye
